{"text_format":"1","workbook":"xlsx","n_sheets":4,"sheets":["Auswertung","Namen","Spieler_n_Ort","Veranstaltungsort"],"not_rendered":{"charts":0,"images":18,"macros":1,"external_links":0,"defined_names":4,"comments":0,"pivot_tables":1},"unopened":[],"bounds":{"document_bytes":16777216,"sheet_cells":100000,"rows_first":2000,"rows_last":500,"rows_between":2000,"halvings":0,"cell_chars":16384,"cell_head_chars":4096},"cells_cut":0,"cells_raw":0,"read":"whole","date_system":"1900"}

{"sheet":"Auswertung","index":0,"n_rows":203,"n_cols":28,"rows_kept":203,"cut":false,"hidden":false,"merged":[[0,5,0,6],[0,9,0,10],[0,3,0,4],[1,0,1,1]]}
[20,2,null,"Hohenau\nStockplatz",null,"15.06.2018",null,null,{"$f":"COUNTA(D4:D144)*50","v":2800},null,null,null,{"$f":"COUNT(F4:F200)/4","v":14},{"$f":"COUNT(G4:G200)/4","v":14},{"$f":"COUNT(H4:H200)/4","v":14},{"$f":"COUNT(I4:I200)/4","v":14},null,null,{"$f":"SUM(S4:S143)","v":1100},1,1,1,1]
["Turnier",null,null,{"$f":"\"Startgeld  \"& A1 & \" €\"","v":"Startgeld  20 €"},null,{"$f":"SUM($F$4:$F$203)","v":2800},{"$f":"SUM($G$4:$G$203)","v":2800},{"$f":"SUM($H$4:$H$203)","v":2800},{"$f":"SUM($I$4:$I$203)","v":2800},null,null,null,null,null,null,null,null,null,null,1,1,1,1]
["Rang","Punkte","Startnr.",{"$f":"\"Namen             Anzahl der Spieler  (\" & SUBTOTAL(3,D4:D203) & \")\"","v":"Namen             Anzahl der Spieler  (56)"},"Ort","1. Runde","2. Runde","3. Runde","4. Runde","Zukauf","Maxpunkte",null,{"$f":"IF(INT(M1)=M1,M1*200,\"\")","v":2800},{"$f":"IF(INT(N1)=N1,N1*200,\"\")","v":2800},{"$f":"IF(INT(O1)=O1,O1*200,\"\")","v":2800},{"$f":"IF(INT(P1)=P1,P1*200,\"\")","v":2800},null,null,"Startgeld","1RZuk","2RZuk","3RZuk","4RZuk"]
[{"$f":"IF(ISERROR(RANK(B4,$B$4:$B$203,0)),\"\",RANK(B4,$B$4:$B$203,0))","v":1},{"$f":"IF(COUNT(F4:I4)=1,SUM(F4:I4)-50,IF(COUNT(F4:I4)=2,SUM(F4:I4)-100,IF(COUNT(F4:I4)=3,SUM(F4:I4)-150,IF(COUNT(F4:I4)=4,SUM(F4:I4)-200,\"\"))))","v":110},{"$f":"IF(D4=\"\",\"\",L4)","v":20},"Strasser Helmut",{"$f":"IF(ISERROR(VLOOKUP(D4,Namen!A:B,2,0)),\"\",VLOOKUP(D4,Namen!A:B,2,0))","v":"Hauskirchen"},45,79,92,94,{"$f":"IF(D4=0,\"\",SUM(T4:W4))","v":0},{"$f":"IF(F4=0,\"\",MAX(F4:I4))","v":94},20,null,null,null,null,{"$f":"IF(ISERROR(VLOOKUP(D4,Namen!A:C,3,0)),\"Z\",VLOOKUP(D4,Namen!A:C,3,0))","v":"m"},{"$f":"IF(ISERROR(VLOOKUP(D4,Namen!A:D,4,0)),\"Z\",VLOOKUP(D4,Namen!A:D,4,0))","v":"ja"},{"$f":"IF(R4=\"ja\",$A$1,0)","v":20},null,null,null,null,{"$f":"IFERROR(B4+(K4*0.0001),\"\")","v":110.0094},{"$f":"IF(ISERROR(RANK(AA4,$AA$4:$AA$203,0)),\"\",RANK(AA4,$AA$4:$AA$203,0))","v":1},{"$f":"IFERROR(LARGE(F4:I4,2),\"\")","v":92},{"$f":"IFERROR(LARGE(F4:I4,3),\"\")","v":79},{"$f":"IFERROR(LARGE(F4:I4,4),\"\")","v":45}]
[{"$f":"IF(ISERROR(RANK(B5,$B$4:$B$203,0)),\"\",RANK(B5,$B$4:$B$203,0))","v":2},{"$f":"IF(COUNT(F5:I5)=1,SUM(F5:I5)-50,IF(COUNT(F5:I5)=2,SUM(F5:I5)-100,IF(COUNT(F5:I5)=3,SUM(F5:I5)-150,IF(COUNT(F5:I5)=4,SUM(F5:I5)-200,\"\"))))","v":106},{"$f":"IF(D5=\"\",\"\",L5)","v":10},"Domitzi Josef",{"$f":"IF(ISERROR(VLOOKUP(D5,Namen!A:B,2,0)),\"\",VLOOKUP(D5,Namen!A:B,2,0))","v":"Prottes"},75,85,78,68,{"$f":"IF(D5=0,\"\",SUM(T5:W5))","v":0},{"$f":"IF(F5=0,\"\",MAX(F5:I5))","v":85},10,null,null,null,null,{"$f":"IF(ISERROR(VLOOKUP(D5,Namen!A:C,3,0)),\"Z\",VLOOKUP(D5,Namen!A:C,3,0))","v":"m"},{"$f":"IF(ISERROR(VLOOKUP(D5,Namen!A:D,4,0)),\"Z\",VLOOKUP(D5,Namen!A:D,4,0))","v":"ja"},{"$f":"IF(R5=\"ja\",$A$1,0)","v":20},null,null,null,null,106.0085,{"$f":"IF(ISERROR(RANK(AA5,$AA$4:$AA$203,0)),\"\",RANK(AA5,$AA$4:$AA$203,0))","v":2},{"$f":"IFERROR(LARGE(F5:I5,2),\"\")","v":78},{"$f":"IFERROR(LARGE(F5:I5,3),\"\")","v":75},{"$f":"IFERROR(LARGE(F5:I5,4),\"\")","v":68}]
[{"$f":"IF(ISERROR(RANK(B6,$B$4:$B$203,0)),\"\",RANK(B6,$B$4:$B$203,0))","v":3},{"$f":"IF(COUNT(F6:I6)=1,SUM(F6:I6)-50,IF(COUNT(F6:I6)=2,SUM(F6:I6)-100,IF(COUNT(F6:I6)=3,SUM(F6:I6)-150,IF(COUNT(F6:I6)=4,SUM(F6:I6)-200,\"\"))))","v":89},{"$f":"IF(D6=\"\",\"\",L6)","v":11},"Mechtler Leopold",{"$f":"IF(ISERROR(VLOOKUP(D6,Namen!A:B,2,0)),\"\",VLOOKUP(D6,Namen!A:B,2,0))","v":"Obersdorf"},40,76,130,43,{"$f":"IF(D6=0,\"\",SUM(T6:W6))","v":0},{"$f":"IF(F6=0,\"\",MAX(F6:I6))","v":130},11,null,null,null,null,{"$f":"IF(ISERROR(VLOOKUP(D6,Namen!A:C,3,0)),\"Z\",VLOOKUP(D6,Namen!A:C,3,0))","v":"m"},{"$f":"IF(ISERROR(VLOOKUP(D6,Namen!A:D,4,0)),\"Z\",VLOOKUP(D6,Namen!A:D,4,0))","v":"ja"},{"$f":"IF(R6=\"ja\",$A$1,0)","v":20},null,null,null,null,89.013000000000005,28,76,43,40]
[{"$f":"IF(ISERROR(RANK(B7,$B$4:$B$203,0)),\"\",RANK(B7,$B$4:$B$203,0))","v":4},{"$f":"IF(COUNT(F7:I7)=1,SUM(F7:I7)-50,IF(COUNT(F7:I7)=2,SUM(F7:I7)-100,IF(COUNT(F7:I7)=3,SUM(F7:I7)-150,IF(COUNT(F7:I7)=4,SUM(F7:I7)-200,\"\"))))","v":80},{"$f":"IF(D7=\"\",\"\",L7)","v":40},"Kaider Josef",{"$f":"IF(ISERROR(VLOOKUP(D7,Namen!A:B,2,0)),\"\",VLOOKUP(D7,Namen!A:B,2,0))","v":"Großkrut"},34,61,88,97,{"$f":"IF(D7=0,\"\",SUM(T7:W7))","v":0},{"$f":"IF(F7=0,\"\",MAX(F7:I7))","v":97},40,null,null,null,null,{"$f":"IF(ISERROR(VLOOKUP(D7,Namen!A:C,3,0)),\"Z\",VLOOKUP(D7,Namen!A:C,3,0))","v":"m"},{"$f":"IF(ISERROR(VLOOKUP(D7,Namen!A:D,4,0)),\"Z\",VLOOKUP(D7,Namen!A:D,4,0))","v":"ja"},{"$f":"IF(R7=\"ja\",$A$1,0)","v":20},null,null,null,null,80.009699999999995,4,88,61,34]
[{"$f":"IF(ISERROR(RANK(B8,$B$4:$B$203,0)),\"\",RANK(B8,$B$4:$B$203,0))","v":5},{"$f":"IF(COUNT(F8:I8)=1,SUM(F8:I8)-50,IF(COUNT(F8:I8)=2,SUM(F8:I8)-100,IF(COUNT(F8:I8)=3,SUM(F8:I8)-150,IF(COUNT(F8:I8)=4,SUM(F8:I8)-200,\"\"))))","v":72},{"$f":"IF(D8=\"\",\"\",L8)","v":32},"Schwec Rudolf",{"$f":"IF(ISERROR(VLOOKUP(D8,Namen!A:B,2,0)),\"\",VLOOKUP(D8,Namen!A:B,2,0))","v":"Hausbrunn"},50,117,48,57,{"$f":"IF(D8=0,\"\",SUM(T8:W8))","v":0},{"$f":"IF(F8=0,\"\",MAX(F8:I8))","v":117},32,null,null,null,null,{"$f":"IF(ISERROR(VLOOKUP(D8,Namen!A:C,3,0)),\"Z\",VLOOKUP(D8,Namen!A:C,3,0))","v":"m"},{"$f":"IF(ISERROR(VLOOKUP(D8,Namen!A:D,4,0)),\"Z\",VLOOKUP(D8,Namen!A:D,4,0))","v":"ja"},{"$f":"IF(R8=\"ja\",$A$1,0)","v":20},null,null,null,null,72.011700000000005,14,57,50,48]
[{"$f":"IF(ISERROR(RANK(B9,$B$4:$B$203,0)),\"\",RANK(B9,$B$4:$B$203,0))","v":6},{"$f":"IF(COUNT(F9:I9)=1,SUM(F9:I9)-50,IF(COUNT(F9:I9)=2,SUM(F9:I9)-100,IF(COUNT(F9:I9)=3,SUM(F9:I9)-150,IF(COUNT(F9:I9)=4,SUM(F9:I9)-200,\"\"))))","v":71},{"$f":"IF(D9=\"\",\"\",L9)","v":22},"Sattler Thomas",{"$f":"IF(ISERROR(VLOOKUP(D9,Namen!A:B,2,0)),\"\",VLOOKUP(D9,Namen!A:B,2,0))","v":"Hohenruppersdorf"},52,65,49,105,{"$f":"IF(D9=0,\"\",SUM(T9:W9))","v":0},{"$f":"IF(F9=0,\"\",MAX(F9:I9))","v":105},22,null,null,null,null,{"$f":"IF(ISERROR(VLOOKUP(D9,Namen!A:C,3,0)),\"Z\",VLOOKUP(D9,Namen!A:C,3,0))","v":"m"},{"$f":"IF(ISERROR(VLOOKUP(D9,Namen!A:D,4,0)),\"Z\",VLOOKUP(D9,Namen!A:D,4,0))","v":"ja"},{"$f":"IF(R9=\"ja\",$A$1,0)","v":20},null,null,null,null,71.010499999999993,11,65,52,49]
[{"$f":"IF(ISERROR(RANK(B10,$B$4:$B$203,0)),\"\",RANK(B10,$B$4:$B$203,0))","v":7},{"$f":"IF(COUNT(F10:I10)=1,SUM(F10:I10)-50,IF(COUNT(F10:I10)=2,SUM(F10:I10)-100,IF(COUNT(F10:I10)=3,SUM(F10:I10)-150,IF(COUNT(F10:I10)=4,SUM(F10:I10)-200,\"\"))))","v":65},{"$f":"IF(D10=\"\",\"\",L10)","v":19},"Hinczica Josef",{"$f":"IF(ISERROR(VLOOKUP(D10,Namen!A:B,2,0)),\"\",VLOOKUP(D10,Namen!A:B,2,0))","v":"Niederabsdorf"},77,51,46,91,{"$f":"IF(D10=0,\"\",SUM(T10:W10))","v":0},{"$f":"IF(F10=0,\"\",MAX(F10:I10))","v":91},19,null,null,null,null,{"$f":"IF(ISERROR(VLOOKUP(D10,Namen!A:C,3,0)),\"Z\",VLOOKUP(D10,Namen!A:C,3,0))","v":"m"},{"$f":"IF(ISERROR(VLOOKUP(D10,Namen!A:D,4,0)),\"Z\",VLOOKUP(D10,Namen!A:D,4,0))","v":"ja"},{"$f":"IF(R10=\"ja\",$A$1,0)","v":20},null,null,null,null,65.009100000000004,12,77,51,46]
[{"$f":"IF(ISERROR(RANK(B11,$B$4:$B$203,0)),\"\",RANK(B11,$B$4:$B$203,0))","v":8},{"$f":"IF(COUNT(F11:I11)=1,SUM(F11:I11)-50,IF(COUNT(F11:I11)=2,SUM(F11:I11)-100,IF(COUNT(F11:I11)=3,SUM(F11:I11)-150,IF(COUNT(F11:I11)=4,SUM(F11:I11)-200,\"\"))))","v":59},{"$f":"IF(D11=\"\",\"\",L11)","v":53},"Pernold Karl",{"$f":"IF(ISERROR(VLOOKUP(D11,Namen!A:B,2,0)),\"\",VLOOKUP(D11,Namen!A:B,2,0))","v":"Hausbrunn"},75,61,68,55,{"$f":"IF(D11=0,\"\",SUM(T11:W11))","v":0},{"$f":"IF(F11=0,\"\",MAX(F11:I11))","v":75},53,null,null,null,null,{"$f":"IF(ISERROR(VLOOKUP(D11,Namen!A:C,3,0)),\"Z\",VLOOKUP(D11,Namen!A:C,3,0))","v":"m"},{"$f":"IF(ISERROR(VLOOKUP(D11,Namen!A:D,4,0)),\"Z\",VLOOKUP(D11,Namen!A:D,4,0))","v":"ja"},{"$f":"IF(R11=\"ja\",$A$1,0)","v":20},null,null,null,null,59.0075,4,68,61,55]
[{"$f":"IF(ISERROR(RANK(B12,$B$4:$B$203,0)),\"\",RANK(B12,$B$4:$B$203,0))","v":9},{"$f":"IF(COUNT(F12:I12)=1,SUM(F12:I12)-50,IF(COUNT(F12:I12)=2,SUM(F12:I12)-100,IF(COUNT(F12:I12)=3,SUM(F12:I12)-150,IF(COUNT(F12:I12)=4,SUM(F12:I12)-200,\"\"))))","v":55},{"$f":"IF(D12=\"\",\"\",L12)","v":38},"Brunnhuber Ernst",{"$f":"IF(ISERROR(VLOOKUP(D12,Namen!A:B,2,0)),\"\",VLOOKUP(D12,Namen!A:B,2,0))","v":"Obergänserndorf"},63,56,96,40,{"$f":"IF(D12=0,\"\",SUM(T12:W12))","v":0},{"$f":"IF(F12=0,\"\",MAX(F12:I12))","v":96},38,null,null,null,null,{"$f":"IF(ISERROR(VLOOKUP(D12,Namen!A:C,3,0)),\"Z\",VLOOKUP(D12,Namen!A:C,3,0))","v":"m"},{"$f":"IF(ISERROR(VLOOKUP(D12,Namen!A:D,4,0)),\"Z\",VLOOKUP(D12,Namen!A:D,4,0))","v":"ja"},{"$f":"IF(R12=\"ja\",$A$1,0)","v":20},null,null,null,null,55.009599999999999,6,63,56,40]
[{"$f":"IF(ISERROR(RANK(B13,$B$4:$B$203,0)),\"\",RANK(B13,$B$4:$B$203,0))","v":10},{"$f":"IF(COUNT(F13:I13)=1,SUM(F13:I13)-50,IF(COUNT(F13:I13)=2,SUM(F13:I13)-100,IF(COUNT(F13:I13)=3,SUM(F13:I13)-150,IF(COUNT(F13:I13)=4,SUM(F13:I13)-200,\"\"))))","v":41},{"$f":"IF(D13=\"\",\"\",L13)","v":13},"Müller Monika",{"$f":"IF(ISERROR(VLOOKUP(D13,Namen!A:B,2,0)),\"\",VLOOKUP(D13,Namen!A:B,2,0))","v":"Weikendorf"},72,53,38,78,{"$f":"IF(D13=0,\"\",SUM(T13:W13))","v":0},{"$f":"IF(F13=0,\"\",MAX(F13:I13))","v":78},13,null,null,null,null,{"$f":"IF(ISERROR(VLOOKUP(D13,Namen!A:C,3,0)),\"Z\",VLOOKUP(D13,Namen!A:C,3,0))","v":"w"},{"$f":"IF(ISERROR(VLOOKUP(D13,Namen!A:D,4,0)),\"Z\",VLOOKUP(D13,Namen!A:D,4,0))","v":"ja"},{"$f":"IF(R13=\"ja\",$A$1,0)","v":20},null,null,null,null,41.007800000000003,10,72,53,38]
[{"$f":"IF(ISERROR(RANK(B14,$B$4:$B$203,0)),\"\",RANK(B14,$B$4:$B$203,0))","v":11},{"$f":"IF(COUNT(F14:I14)=1,SUM(F14:I14)-50,IF(COUNT(F14:I14)=2,SUM(F14:I14)-100,IF(COUNT(F14:I14)=3,SUM(F14:I14)-150,IF(COUNT(F14:I14)=4,SUM(F14:I14)-200,\"\"))))","v":39},{"$f":"IF(D14=\"\",\"\",L14)","v":47},"Sperk Franz",{"$f":"IF(ISERROR(VLOOKUP(D14,Namen!A:B,2,0)),\"\",VLOOKUP(D14,Namen!A:B,2,0))","v":"Jedenspeigen"},64,55,44,76,{"$f":"IF(D14=0,\"\",SUM(T14:W14))","v":0},{"$f":"IF(F14=0,\"\",MAX(F14:I14))","v":76},47,null,null,null,null,{"$f":"IF(ISERROR(VLOOKUP(D14,Namen!A:C,3,0)),\"Z\",VLOOKUP(D14,Namen!A:C,3,0))","v":"m"},{"$f":"IF(ISERROR(VLOOKUP(D14,Namen!A:D,4,0)),\"Z\",VLOOKUP(D14,Namen!A:D,4,0))","v":"ja"},{"$f":"IF(R14=\"ja\",$A$1,0)","v":20},null,null,null,null,39.007599999999996,9,64,55,44]
[{"$f":"IF(ISERROR(RANK(B15,$B$4:$B$203,0)),\"\",RANK(B15,$B$4:$B$203,0))","v":12},{"$f":"IF(COUNT(F15:I15)=1,SUM(F15:I15)-50,IF(COUNT(F15:I15)=2,SUM(F15:I15)-100,IF(COUNT(F15:I15)=3,SUM(F15:I15)-150,IF(COUNT(F15:I15)=4,SUM(F15:I15)-200,\"\"))))","v":38},{"$f":"IF(D15=\"\",\"\",L15)","v":3},"Hüttner Erich",{"$f":"IF(ISERROR(VLOOKUP(D15,Namen!A:B,2,0)),\"\",VLOOKUP(D15,Namen!A:B,2,0))","v":"Hohenau"},70,65,92,11,{"$f":"IF(D15=0,\"\",SUM(T15:W15))","v":0},{"$f":"IF(F15=0,\"\",MAX(F15:I15))","v":92},3,null,null,null,null,{"$f":"IF(ISERROR(VLOOKUP(D15,Namen!A:C,3,0)),\"Z\",VLOOKUP(D15,Namen!A:C,3,0))","v":"m"},{"$f":"IF(ISERROR(VLOOKUP(D15,Namen!A:D,4,0)),\"Z\",VLOOKUP(D15,Namen!A:D,4,0))","v":"ja"},{"$f":"IF(R15=\"ja\",$A$1,0)","v":20},null,null,null,null,38.0092,3,70,65,11]
[{"$f":"IF(ISERROR(RANK(B16,$B$4:$B$203,0)),\"\",RANK(B16,$B$4:$B$203,0))","v":13},{"$f":"IF(COUNT(F16:I16)=1,SUM(F16:I16)-50,IF(COUNT(F16:I16)=2,SUM(F16:I16)-100,IF(COUNT(F16:I16)=3,SUM(F16:I16)-150,IF(COUNT(F16:I16)=4,SUM(F16:I16)-200,\"\"))))","v":36},{"$f":"IF(D16=\"\",\"\",L16)","v":34},"Marchart Franz",{"$f":"IF(ISERROR(VLOOKUP(D16,Namen!A:B,2,0)),\"\",VLOOKUP(D16,Namen!A:B,2,0))","v":"Großkrut"},56,101,36,43,{"$f":"IF(D16=0,\"\",SUM(T16:W16))","v":0},{"$f":"IF(F16=0,\"\",MAX(F16:I16))","v":101},34,null,null,null,null,{"$f":"IF(ISERROR(VLOOKUP(D16,Namen!A:C,3,0)),\"Z\",VLOOKUP(D16,Namen!A:C,3,0))","v":"m"},{"$f":"IF(ISERROR(VLOOKUP(D16,Namen!A:D,4,0)),\"Z\",VLOOKUP(D16,Namen!A:D,4,0))","v":"ja"},{"$f":"IF(R16=\"ja\",$A$1,0)","v":20},null,null,null,null,36.010100000000001,28,56,43,36]
[{"$f":"IF(ISERROR(RANK(B17,$B$4:$B$203,0)),\"\",RANK(B17,$B$4:$B$203,0))","v":14},{"$f":"IF(COUNT(F17:I17)=1,SUM(F17:I17)-50,IF(COUNT(F17:I17)=2,SUM(F17:I17)-100,IF(COUNT(F17:I17)=3,SUM(F17:I17)-150,IF(COUNT(F17:I17)=4,SUM(F17:I17)-200,\"\"))))","v":22},{"$f":"IF(D17=\"\",\"\",L17)","v":7},"Ubl Bernhard",{"$f":"IF(ISERROR(VLOOKUP(D17,Namen!A:B,2,0)),\"\",VLOOKUP(D17,Namen!A:B,2,0))","v":"Bockfließ"},93,34,48,47,{"$f":"IF(D17=0,\"\",SUM(T17:W17))","v":0},{"$f":"IF(F17=0,\"\",MAX(F17:I17))","v":93},7,null,null,null,null,{"$f":"IF(ISERROR(VLOOKUP(D17,Namen!A:C,3,0)),\"Z\",VLOOKUP(D17,Namen!A:C,3,0))","v":"m"},{"$f":"IF(ISERROR(VLOOKUP(D17,Namen!A:D,4,0)),\"Z\",VLOOKUP(D17,Namen!A:D,4,0))","v":"ja"},{"$f":"IF(R17=\"ja\",$A$1,0)","v":20},null,null,null,null,22.0093,21,48,47,34]
[{"$f":"IF(ISERROR(RANK(B18,$B$4:$B$203,0)),\"\",RANK(B18,$B$4:$B$203,0))","v":15},{"$f":"IF(COUNT(F18:I18)=1,SUM(F18:I18)-50,IF(COUNT(F18:I18)=2,SUM(F18:I18)-100,IF(COUNT(F18:I18)=3,SUM(F18:I18)-150,IF(COUNT(F18:I18)=4,SUM(F18:I18)-200,\"\"))))","v":20},{"$f":"IF(D18=\"\",\"\",L18)","v":26},"Seiter Franz",{"$f":"IF(ISERROR(VLOOKUP(D18,Namen!A:B,2,0)),\"\",VLOOKUP(D18,Namen!A:B,2,0))","v":"Waltersdorf"},33,70,61,56,{"$f":"IF(D18=0,\"\",SUM(T18:W18))","v":0},{"$f":"IF(F18=0,\"\",MAX(F18:I18))","v":70},26,null,null,null,null,{"$f":"IF(ISERROR(VLOOKUP(D18,Namen!A:C,3,0)),\"Z\",VLOOKUP(D18,Namen!A:C,3,0))","v":"m"},{"$f":"IF(ISERROR(VLOOKUP(D18,Namen!A:D,4,0)),\"Z\",VLOOKUP(D18,Namen!A:D,4,0))","v":"ja"},{"$f":"IF(R18=\"ja\",$A$1,0)","v":20},null,null,null,null,20.007000000000001,6,61,56,33]
[{"$f":"IF(ISERROR(RANK(B19,$B$4:$B$203,0)),\"\",RANK(B19,$B$4:$B$203,0))","v":16},{"$f":"IF(COUNT(F19:I19)=1,SUM(F19:I19)-50,IF(COUNT(F19:I19)=2,SUM(F19:I19)-100,IF(COUNT(F19:I19)=3,SUM(F19:I19)-150,IF(COUNT(F19:I19)=4,SUM(F19:I19)-200,\"\"))))","v":16},{"$f":"IF(D19=\"\",\"\",L19)","v":37},"Kainz Karl",{"$f":"IF(ISERROR(VLOOKUP(D19,Namen!A:B,2,0)),\"\",VLOOKUP(D19,Namen!A:B,2,0))","v":"Obergänserndorf"},46,57,30,83,{"$f":"IF(D19=0,\"\",SUM(T19:W19))","v":0},{"$f":"IF(F19=0,\"\",MAX(F19:I19))","v":83},37,null,null,null,null,{"$f":"IF(ISERROR(VLOOKUP(D19,Namen!A:C,3,0)),\"Z\",VLOOKUP(D19,Namen!A:C,3,0))","v":"m"},{"$f":"IF(ISERROR(VLOOKUP(D19,Namen!A:D,4,0)),\"Z\",VLOOKUP(D19,Namen!A:D,4,0))","v":"ja"},{"$f":"IF(R19=\"ja\",$A$1,0)","v":20},null,null,null,null,16.008299999999998,22,57,46,30]
[{"$f":"IF(ISERROR(RANK(B20,$B$4:$B$203,0)),\"\",RANK(B20,$B$4:$B$203,0))","v":17},{"$f":"IF(COUNT(F20:I20)=1,SUM(F20:I20)-50,IF(COUNT(F20:I20)=2,SUM(F20:I20)-100,IF(COUNT(F20:I20)=3,SUM(F20:I20)-150,IF(COUNT(F20:I20)=4,SUM(F20:I20)-200,\"\"))))","v":15},{"$f":"IF(D20=\"\",\"\",L20)","v":41},"Rosenmayer Paul",{"$f":"IF(ISERROR(VLOOKUP(D20,Namen!A:B,2,0)),\"\",VLOOKUP(D20,Namen!A:B,2,0))","v":"Wien"},42,67,64,42,{"$f":"IF(D20=0,\"\",SUM(T20:W20))","v":0},{"$f":"IF(F20=0,\"\",MAX(F20:I20))","v":67},41,null,null,null,null,{"$f":"IF(ISERROR(VLOOKUP(D20,Namen!A:C,3,0)),\"Z\",VLOOKUP(D20,Namen!A:C,3,0))","v":"m"},{"$f":"IF(ISERROR(VLOOKUP(D20,Namen!A:D,4,0)),\"Z\",VLOOKUP(D20,Namen!A:D,4,0))","v":"ja"},{"$f":"IF(R20=\"ja\",$A$1,0)","v":20},null,null,null,null,15.0067,33,64,42,42]
{"$rows_left_out":184}
{"sheet":"Namen","index":1,"n_rows":748,"n_cols":4,"rows_kept":748,"cut":false,"hidden":false,"merged":[]}
["Name","Wohnort","Geschlecht","Startgeld"]
["Aigner Johann","n.n.","m","ja"]
["Alker Christiane","n.n.","w","ja"]
["Alram Norbert","Strasshof","m","ja"]
["Amon Josef","Großschweinbarth","m","ja"]
["Annawitt Regina","Hausbrunn","w","ja"]
["Antony Anton","Großkrut","m","ja"]
["Antosch Otmar","Hausbrunn","m","ja"]
["Aprea Johannes","Schleinbach","m","ja"]
["Artner Gustav","n.n.","m","ja"]
["Babinetz Andre ","n.n.","m","ja"]
["Barth Josef","n.n.","m","ja"]
["Batoha Reinhard","Hauskirchen","m","ja"]
["Bauer Rudi","Ebersdorf","m","ja"]
["Bayer Ernst","Hohenau","m","ja"]
["Bayer Wolfgang","Baumgarten/Tullnerfeld","m","ja"]
["Becher Alois","Althöflein","m","ja"]
["Berger Alois","Wien","m","ja"]
["Berger Leopold","Ebenthal","m","ja"]
["Bergmann Herbert","Strasshof","m","ja"]
{"$rows_left_out":729}
{"sheet":"Spieler_n_Ort","index":2,"n_rows":69,"n_cols":2,"rows_kept":69,"cut":false,"hidden":false,"merged":[]}
["Ort","Anzahl von Ort"]
[null,41]
["Wien",18]
["Hausbrunn",15]
["Hohenau",10]
["Großkrut",6]
["Strasshof",6]
["Gänserndorf",5]
["Niederabsdorf",4]
["Reyersdorf",3]
["Ollersdorf",3]
["Reintal",3]
["Schleinbach",3]
["Breitensee",3]
["Obergänserndorf",3]
["Langenrohr",3]
["Großschweinbarth",3]
["Angern",3]
["Prottes",3]
["Rabensburg",3]
{"$rows_left_out":50}
{"sheet":"Veranstaltungsort","index":3,"n_rows":34,"n_cols":2,"rows_kept":34,"cut":false,"hidden":false,"merged":[]}
["Ort","Lokalität"]
["Angern an der March","GH Kunst"]
["Au","GH Riepl"]
["Bad Pirawarth","GH Novakovic"]
["Ebenthal","Cafe Pub Paula"]
["Enzersfeld","Sportplatz-Kantine"]
["Fuchsenbigl","GH Leberbauer"]
["Gaweinstal","Heurigenlokal Zickl"]
["Großengersdorf","GH Glöckler"]
["Großkrut","Heurigenlokal Weingartshofer"]
["Großrußbach","Sportplatz-Kantine"]
["Groß-Schweinbarth","Hofkeller"]
["Hausbrunn","Atrium"]
["Hausbrunn","GH Schweinberger"]
["Hohenau","Stockplatz"]
["Hüttendorf","Alte Schule"]
["Kollnbrunn","GH Urbanusalm"]
["Kottingneusiedl","GH Zum edlen Tropfen"]
["Langenrohr","Sportplatz-Kantine"]
["Obergänserndorf","Sportplatz-Kantine"]
{"$rows_left_out":14}