{"text_format":"1","workbook":"xlsx","n_sheets":4,"sheets":["Auswertung","Namen","Spieler_n_Ort","Veranstaltungsort"],"not_rendered":{"charts":0,"images":18,"macros":1,"external_links":0,"defined_names":4,"comments":0,"pivot_tables":1},"unopened":[],"bounds":{"document_bytes":16777216,"sheet_cells":100000,"rows_first":2000,"rows_last":500,"rows_between":2000,"halvings":0,"cell_chars":16384,"cell_head_chars":4096},"cells_cut":0,"cells_raw":0,"read":"whole","date_system":"1900"}

{"sheet":"Auswertung","index":0,"n_rows":203,"n_cols":28,"rows_kept":203,"cut":false,"hidden":false,"merged":[[0,5,0,6],[0,9,0,10],[0,3,0,4],[1,0,1,1]]}
[20,2,null,"Hohenau\nStockplatz",null,"15.06.2018",null,null,{"$f":"COUNTA(D4:D144)*50","v":2800},null,null,null,{"$f":"COUNT(F4:F200)/4","v":14},{"$f":"COUNT(G4:G200)/4","v":14},{"$f":"COUNT(H4:H200)/4","v":14},{"$f":"COUNT(I4:I200)/4","v":14},null,null,{"$f":"SUM(S4:S143)","v":1100},1,1,1,1]
["Turnier",null,null,{"$f":"\"Startgeld  \"& A1 & \" €\"","v":"Startgeld  20 €"},null,{"$f":"SUM($F$4:$F$203)","v":2800},{"$f":"SUM($G$4:$G$203)","v":2800},{"$f":"SUM($H$4:$H$203)","v":2800},{"$f":"SUM($I$4:$I$203)","v":2800},null,null,null,null,null,null,null,null,null,null,1,1,1,1]
["Rang","Punkte","Startnr.",{"$f":"\"Namen             Anzahl der Spieler  (\" & SUBTOTAL(3,D4:D203) & \")\"","v":"Namen             Anzahl der Spieler  (56)"},"Ort","1. Runde","2. Runde","3. Runde","4. Runde","Zukauf","Maxpunkte",null,{"$f":"IF(INT(M1)=M1,M1*200,\"\")","v":2800},{"$f":"IF(INT(N1)=N1,N1*200,\"\")","v":2800},{"$f":"IF(INT(O1)=O1,O1*200,\"\")","v":2800},{"$f":"IF(INT(P1)=P1,P1*200,\"\")","v":2800},null,null,"Startgeld","1RZuk","2RZuk","3RZuk","4RZuk"]
[{"$f":"IF(ISERROR(RANK(B4,$B$4:$B$203,0)),\"\",RANK(B4,$B$4:$B$203,0))","v":1},{"$f":"IF(COUNT(F4:I4)=1,SUM(F4:I4)-50,IF(COUNT(F4:I4)=2,SUM(F4:I4)-100,IF(COUNT(F4:I4)=3,SUM(F4:I4)-150,IF(COUNT(F4:I4)=4,SUM(F4:I4)-200,\"\"))))","v":110},{"$f":"IF(D4=\"\",\"\",L4)","v":20},"Strasser Helmut",{"$f":"IF(ISERROR(VLOOKUP(D4,Namen!A:B,2,0)),\"\",VLOOKUP(D4,Namen!A:B,2,0))","v":"Hauskirchen"},45,79,92,94,{"$f":"IF(D4=0,\"\",SUM(T4:W4))","v":0},{"$f":"IF(F4=0,\"\",MAX(F4:I4))","v":94},20,null,null,null,null,{"$f":"IF(ISERROR(VLOOKUP(D4,Namen!A:C,3,0)),\"Z\",VLOOKUP(D4,Namen!A:C,3,0))","v":"m"},{"$f":"IF(ISERROR(VLOOKUP(D4,Namen!A:D,4,0)),\"Z\",VLOOKUP(D4,Namen!A:D,4,0))","v":"ja"},{"$f":"IF(R4=\"ja\",$A$1,0)","v":20},null,null,null,null,{"$f":"IFERROR(B4+(K4*0.0001),\"\")","v":110.0094},{"$f":"IF(ISERROR(RANK(AA4,$AA$4:$AA$203,0)),\"\",RANK(AA4,$AA$4:$AA$203,0))","v":1},{"$f":"IFERROR(LARGE(F4:I4,2),\"\")","v":92},{"$f":"IFERROR(LARGE(F4:I4,3),\"\")","v":79},{"$f":"IFERROR(LARGE(F4:I4,4),\"\")","v":45}]
[{"$f":"IF(ISERROR(RANK(B5,$B$4:$B$203,0)),\"\",RANK(B5,$B$4:$B$203,0))","v":2},{"$f":"IF(COUNT(F5:I5)=1,SUM(F5:I5)-50,IF(COUNT(F5:I5)=2,SUM(F5:I5)-100,IF(COUNT(F5:I5)=3,SUM(F5:I5)-150,IF(COUNT(F5:I5)=4,SUM(F5:I5)-200,\"\"))))","v":106},{"$f":"IF(D5=\"\",\"\",L5)","v":10},"Domitzi Josef",{"$f":"IF(ISERROR(VLOOKUP(D5,Namen!A:B,2,0)),\"\",VLOOKUP(D5,Namen!A:B,2,0))","v":"Prottes"},75,85,78,68,{"$f":"IF(D5=0,\"\",SUM(T5:W5))","v":0},{"$f":"IF(F5=0,\"\",MAX(F5:I5))","v":85},10,null,null,null,null,{"$f":"IF(ISERROR(VLOOKUP(D5,Namen!A:C,3,0)),\"Z\",VLOOKUP(D5,Namen!A:C,3,0))","v":"m"},{"$f":"IF(ISERROR(VLOOKUP(D5,Namen!A:D,4,0)),\"Z\",VLOOKUP(D5,Namen!A:D,4,0))","v":"ja"},{"$f":"IF(R5=\"ja\",$A$1,0)","v":20},null,null,null,null,106.0085,{"$f":"IF(ISERROR(RANK(AA5,$AA$4:$AA$203,0)),\"\",RANK(AA5,$AA$4:$AA$203,0))","v":2},{"$f":"IFERROR(LARGE(F5:I5,2),\"\")","v":78},{"$f":"IFERROR(LARGE(F5:I5,3),\"\")","v":75},{"$f":"IFERROR(LARGE(F5:I5,4),\"\")","v":68}]
[{"$f":"IF(ISERROR(RANK(B6,$B$4:$B$203,0)),\"\",RANK(B6,$B$4:$B$203,0))","v":3},{"$f":"IF(COUNT(F6:I6)=1,SUM(F6:I6)-50,IF(COUNT(F6:I6)=2,SUM(F6:I6)-100,IF(COUNT(F6:I6)=3,SUM(F6:I6)-150,IF(COUNT(F6:I6)=4,SUM(F6:I6)-200,\"\"))))","v":89},{"$f":"IF(D6=\"\",\"\",L6)","v":11},"Mechtler Leopold",{"$f":"IF(ISERROR(VLOOKUP(D6,Namen!A:B,2,0)),\"\",VLOOKUP(D6,Namen!A:B,2,0))","v":"Obersdorf"},40,76,130,43,{"$f":"IF(D6=0,\"\",SUM(T6:W6))","v":0},{"$f":"IF(F6=0,\"\",MAX(F6:I6))","v":130},11,null,null,null,null,{"$f":"IF(ISERROR(VLOOKUP(D6,Namen!A:C,3,0)),\"Z\",VLOOKUP(D6,Namen!A:C,3,0))","v":"m"},{"$f":"IF(ISERROR(VLOOKUP(D6,Namen!A:D,4,0)),\"Z\",VLOOKUP(D6,Namen!A:D,4,0))","v":"ja"},{"$f":"IF(R6=\"ja\",$A$1,0)","v":20},null,null,null,null,89.013000000000005,28,76,43,40]
[{"$f":"IF(ISERROR(RANK(B7,$B$4:$B$203,0)),\"\",RANK(B7,$B$4:$B$203,0))","v":4},{"$f":"IF(COUNT(F7:I7)=1,SUM(F7:I7)-50,IF(COUNT(F7:I7)=2,SUM(F7:I7)-100,IF(COUNT(F7:I7)=3,SUM(F7:I7)-150,IF(COUNT(F7:I7)=4,SUM(F7:I7)-200,\"\"))))","v":80},{"$f":"IF(D7=\"\",\"\",L7)","v":40},"Kaider Josef",{"$f":"IF(ISERROR(VLOOKUP(D7,Namen!A:B,2,0)),\"\",VLOOKUP(D7,Namen!A:B,2,0))","v":"Großkrut"},34,61,88,97,{"$f":"IF(D7=0,\"\",SUM(T7:W7))","v":0},{"$f":"IF(F7=0,\"\",MAX(F7:I7))","v":97},40,null,null,null,null,{"$f":"IF(ISERROR(VLOOKUP(D7,Namen!A:C,3,0)),\"Z\",VLOOKUP(D7,Namen!A:C,3,0))","v":"m"},{"$f":"IF(ISERROR(VLOOKUP(D7,Namen!A:D,4,0)),\"Z\",VLOOKUP(D7,Namen!A:D,4,0))","v":"ja"},{"$f":"IF(R7=\"ja\",$A$1,0)","v":20},null,null,null,null,80.009699999999995,4,88,61,34]
[{"$f":"IF(ISERROR(RANK(B8,$B$4:$B$203,0)),\"\",RANK(B8,$B$4:$B$203,0))","v":5},{"$f":"IF(COUNT(F8:I8)=1,SUM(F8:I8)-50,IF(COUNT(F8:I8)=2,SUM(F8:I8)-100,IF(COUNT(F8:I8)=3,SUM(F8:I8)-150,IF(COUNT(F8:I8)=4,SUM(F8:I8)-200,\"\"))))","v":72},{"$f":"IF(D8=\"\",\"\",L8)","v":32},"Schwec Rudolf",{"$f":"IF(ISERROR(VLOOKUP(D8,Namen!A:B,2,0)),\"\",VLOOKUP(D8,Namen!A:B,2,0))","v":"Hausbrunn"},50,117,48,57,{"$f":"IF(D8=0,\"\",SUM(T8:W8))","v":0},{"$f":"IF(F8=0,\"\",MAX(F8:I8))","v":117},32,null,null,null,null,{"$f":"IF(ISERROR(VLOOKUP(D8,Namen!A:C,3,0)),\"Z\",VLOOKUP(D8,Namen!A:C,3,0))","v":"m"},{"$f":"IF(ISERROR(VLOOKUP(D8,Namen!A:D,4,0)),\"Z\",VLOOKUP(D8,Namen!A:D,4,0))","v":"ja"},{"$f":"IF(R8=\"ja\",$A$1,0)","v":20},null,null,null,null,72.011700000000005,14,57,50,48]
[{"$f":"IF(ISERROR(RANK(B9,$B$4:$B$203,0)),\"\",RANK(B9,$B$4:$B$203,0))","v":6},{"$f":"IF(COUNT(F9:I9)=1,SUM(F9:I9)-50,IF(COUNT(F9:I9)=2,SUM(F9:I9)-100,IF(COUNT(F9:I9)=3,SUM(F9:I9)-150,IF(COUNT(F9:I9)=4,SUM(F9:I9)-200,\"\"))))","v":71},{"$f":"IF(D9=\"\",\"\",L9)","v":22},"Sattler Thomas",{"$f":"IF(ISERROR(VLOOKUP(D9,Namen!A:B,2,0)),\"\",VLOOKUP(D9,Namen!A:B,2,0))","v":"Hohenruppersdorf"},52,65,49,105,{"$f":"IF(D9=0,\"\",SUM(T9:W9))","v":0},{"$f":"IF(F9=0,\"\",MAX(F9:I9))","v":105},22,null,null,null,null,{"$f":"IF(ISERROR(VLOOKUP(D9,Namen!A:C,3,0)),\"Z\",VLOOKUP(D9,Namen!A:C,3,0))","v":"m"},{"$f":"IF(ISERROR(VLOOKUP(D9,Namen!A:D,4,0)),\"Z\",VLOOKUP(D9,Namen!A:D,4,0))","v":"ja"},{"$f":"IF(R9=\"ja\",$A$1,0)","v":20},null,null,null,null,71.010499999999993,11,65,52,49]
[{"$f":"IF(ISERROR(RANK(B10,$B$4:$B$203,0)),\"\",RANK(B10,$B$4:$B$203,0))","v":7},{"$f":"IF(COUNT(F10:I10)=1,SUM(F10:I10)-50,IF(COUNT(F10:I10)=2,SUM(F10:I10)-100,IF(COUNT(F10:I10)=3,SUM(F10:I10)-150,IF(COUNT(F10:I10)=4,SUM(F10:I10)-200,\"\"))))","v":65},{"$f":"IF(D10=\"\",\"\",L10)","v":19},"Hinczica Josef",{"$f":"IF(ISERROR(VLOOKUP(D10,Namen!A:B,2,0)),\"\",VLOOKUP(D10,Namen!A:B,2,0))","v":"Niederabsdorf"},77,51,46,91,{"$f":"IF(D10=0,\"\",SUM(T10:W10))","v":0},{"$f":"IF(F10=0,\"\",MAX(F10:I10))","v":91},19,null,null,null,null,{"$f":"IF(ISERROR(VLOOKUP(D10,Namen!A:C,3,0)),\"Z\",VLOOKUP(D10,Namen!A:C,3,0))","v":"m"},{"$f":"IF(ISERROR(VLOOKUP(D10,Namen!A:D,4,0)),\"Z\",VLOOKUP(D10,Namen!A:D,4,0))","v":"ja"},{"$f":"IF(R10=\"ja\",$A$1,0)","v":20},null,null,null,null,65.009100000000004,12,77,51,46]
[{"$f":"IF(ISERROR(RANK(B11,$B$4:$B$203,0)),\"\",RANK(B11,$B$4:$B$203,0))","v":8},{"$f":"IF(COUNT(F11:I11)=1,SUM(F11:I11)-50,IF(COUNT(F11:I11)=2,SUM(F11:I11)-100,IF(COUNT(F11:I11)=3,SUM(F11:I11)-150,IF(COUNT(F11:I11)=4,SUM(F11:I11)-200,\"\"))))","v":59},{"$f":"IF(D11=\"\",\"\",L11)","v":53},"Pernold Karl",{"$f":"IF(ISERROR(VLOOKUP(D11,Namen!A:B,2,0)),\"\",VLOOKUP(D11,Namen!A:B,2,0))","v":"Hausbrunn"},75,61,68,55,{"$f":"IF(D11=0,\"\",SUM(T11:W11))","v":0},{"$f":"IF(F11=0,\"\",MAX(F11:I11))","v":75},53,null,null,null,null,{"$f":"IF(ISERROR(VLOOKUP(D11,Namen!A:C,3,0)),\"Z\",VLOOKUP(D11,Namen!A:C,3,0))","v":"m"},{"$f":"IF(ISERROR(VLOOKUP(D11,Namen!A:D,4,0)),\"Z\",VLOOKUP(D11,Namen!A:D,4,0))","v":"ja"},{"$f":"IF(R11=\"ja\",$A$1,0)","v":20},null,null,null,null,59.0075,4,68,61,55]
[{"$f":"IF(ISERROR(RANK(B12,$B$4:$B$203,0)),\"\",RANK(B12,$B$4:$B$203,0))","v":9},{"$f":"IF(COUNT(F12:I12)=1,SUM(F12:I12)-50,IF(COUNT(F12:I12)=2,SUM(F12:I12)-100,IF(COUNT(F12:I12)=3,SUM(F12:I12)-150,IF(COUNT(F12:I12)=4,SUM(F12:I12)-200,\"\"))))","v":55},{"$f":"IF(D12=\"\",\"\",L12)","v":38},"Brunnhuber Ernst",{"$f":"IF(ISERROR(VLOOKUP(D12,Namen!A:B,2,0)),\"\",VLOOKUP(D12,Namen!A:B,2,0))","v":"Obergänserndorf"},63,56,96,40,{"$f":"IF(D12=0,\"\",SUM(T12:W12))","v":0},{"$f":"IF(F12=0,\"\",MAX(F12:I12))","v":96},38,null,null,null,null,{"$f":"IF(ISERROR(VLOOKUP(D12,Namen!A:C,3,0)),\"Z\",VLOOKUP(D12,Namen!A:C,3,0))","v":"m"},{"$f":"IF(ISERROR(VLOOKUP(D12,Namen!A:D,4,0)),\"Z\",VLOOKUP(D12,Namen!A:D,4,0))","v":"ja"},{"$f":"IF(R12=\"ja\",$A$1,0)","v":20},null,null,null,null,55.009599999999999,6,63,56,40]
[{"$f":"IF(ISERROR(RANK(B13,$B$4:$B$203,0)),\"\",RANK(B13,$B$4:$B$203,0))","v":10},{"$f":"IF(COUNT(F13:I13)=1,SUM(F13:I13)-50,IF(COUNT(F13:I13)=2,SUM(F13:I13)-100,IF(COUNT(F13:I13)=3,SUM(F13:I13)-150,IF(COUNT(F13:I13)=4,SUM(F13:I13)-200,\"\"))))","v":41},{"$f":"IF(D13=\"\",\"\",L13)","v":13},"Müller Monika",{"$f":"IF(ISERROR(VLOOKUP(D13,Namen!A:B,2,0)),\"\",VLOOKUP(D13,Namen!A:B,2,0))","v":"Weikendorf"},72,53,38,78,{"$f":"IF(D13=0,\"\",SUM(T13:W13))","v":0},{"$f":"IF(F13=0,\"\",MAX(F13:I13))","v":78},13,null,null,null,null,{"$f":"IF(ISERROR(VLOOKUP(D13,Namen!A:C,3,0)),\"Z\",VLOOKUP(D13,Namen!A:C,3,0))","v":"w"},{"$f":"IF(ISERROR(VLOOKUP(D13,Namen!A:D,4,0)),\"Z\",VLOOKUP(D13,Namen!A:D,4,0))","v":"ja"},{"$f":"IF(R13=\"ja\",$A$1,0)","v":20},null,null,null,null,41.007800000000003,10,72,53,38]
[{"$f":"IF(ISERROR(RANK(B14,$B$4:$B$203,0)),\"\",RANK(B14,$B$4:$B$203,0))","v":11},{"$f":"IF(COUNT(F14:I14)=1,SUM(F14:I14)-50,IF(COUNT(F14:I14)=2,SUM(F14:I14)-100,IF(COUNT(F14:I14)=3,SUM(F14:I14)-150,IF(COUNT(F14:I14)=4,SUM(F14:I14)-200,\"\"))))","v":39},{"$f":"IF(D14=\"\",\"\",L14)","v":47},"Sperk Franz",{"$f":"IF(ISERROR(VLOOKUP(D14,Namen!A:B,2,0)),\"\",VLOOKUP(D14,Namen!A:B,2,0))","v":"Jedenspeigen"},64,55,44,76,{"$f":"IF(D14=0,\"\",SUM(T14:W14))","v":0},{"$f":"IF(F14=0,\"\",MAX(F14:I14))","v":76},47,null,null,null,null,{"$f":"IF(ISERROR(VLOOKUP(D14,Namen!A:C,3,0)),\"Z\",VLOOKUP(D14,Namen!A:C,3,0))","v":"m"},{"$f":"IF(ISERROR(VLOOKUP(D14,Namen!A:D,4,0)),\"Z\",VLOOKUP(D14,Namen!A:D,4,0))","v":"ja"},{"$f":"IF(R14=\"ja\",$A$1,0)","v":20},null,null,null,null,39.007599999999996,9,64,55,44]
[{"$f":"IF(ISERROR(RANK(B15,$B$4:$B$203,0)),\"\",RANK(B15,$B$4:$B$203,0))","v":12},{"$f":"IF(COUNT(F15:I15)=1,SUM(F15:I15)-50,IF(COUNT(F15:I15)=2,SUM(F15:I15)-100,IF(COUNT(F15:I15)=3,SUM(F15:I15)-150,IF(COUNT(F15:I15)=4,SUM(F15:I15)-200,\"\"))))","v":38},{"$f":"IF(D15=\"\",\"\",L15)","v":3},"Hüttner Erich",{"$f":"IF(ISERROR(VLOOKUP(D15,Namen!A:B,2,0)),\"\",VLOOKUP(D15,Namen!A:B,2,0))","v":"Hohenau"},70,65,92,11,{"$f":"IF(D15=0,\"\",SUM(T15:W15))","v":0},{"$f":"IF(F15=0,\"\",MAX(F15:I15))","v":92},3,null,null,null,null,{"$f":"IF(ISERROR(VLOOKUP(D15,Namen!A:C,3,0)),\"Z\",VLOOKUP(D15,Namen!A:C,3,0))","v":"m"},{"$f":"IF(ISERROR(VLOOKUP(D15,Namen!A:D,4,0)),\"Z\",VLOOKUP(D15,Namen!A:D,4,0))","v":"ja"},{"$f":"IF(R15=\"ja\",$A$1,0)","v":20},null,null,null,null,38.0092,3,70,65,11]
[{"$f":"IF(ISERROR(RANK(B16,$B$4:$B$203,0)),\"\",RANK(B16,$B$4:$B$203,0))","v":13},{"$f":"IF(COUNT(F16:I16)=1,SUM(F16:I16)-50,IF(COUNT(F16:I16)=2,SUM(F16:I16)-100,IF(COUNT(F16:I16)=3,SUM(F16:I16)-150,IF(COUNT(F16:I16)=4,SUM(F16:I16)-200,\"\"))))","v":36},{"$f":"IF(D16=\"\",\"\",L16)","v":34},"Marchart Franz",{"$f":"IF(ISERROR(VLOOKUP(D16,Namen!A:B,2,0)),\"\",VLOOKUP(D16,Namen!A:B,2,0))","v":"Großkrut"},56,101,36,43,{"$f":"IF(D16=0,\"\",SUM(T16:W16))","v":0},{"$f":"IF(F16=0,\"\",MAX(F16:I16))","v":101},34,null,null,null,null,{"$f":"IF(ISERROR(VLOOKUP(D16,Namen!A:C,3,0)),\"Z\",VLOOKUP(D16,Namen!A:C,3,0))","v":"m"},{"$f":"IF(ISERROR(VLOOKUP(D16,Namen!A:D,4,0)),\"Z\",VLOOKUP(D16,Namen!A:D,4,0))","v":"ja"},{"$f":"IF(R16=\"ja\",$A$1,0)","v":20},null,null,null,null,36.010100000000001,28,56,43,36]
[{"$f":"IF(ISERROR(RANK(B17,$B$4:$B$203,0)),\"\",RANK(B17,$B$4:$B$203,0))","v":14},{"$f":"IF(COUNT(F17:I17)=1,SUM(F17:I17)-50,IF(COUNT(F17:I17)=2,SUM(F17:I17)-100,IF(COUNT(F17:I17)=3,SUM(F17:I17)-150,IF(COUNT(F17:I17)=4,SUM(F17:I17)-200,\"\"))))","v":22},{"$f":"IF(D17=\"\",\"\",L17)","v":7},"Ubl Bernhard",{"$f":"IF(ISERROR(VLOOKUP(D17,Namen!A:B,2,0)),\"\",VLOOKUP(D17,Namen!A:B,2,0))","v":"Bockfließ"},93,34,48,47,{"$f":"IF(D17=0,\"\",SUM(T17:W17))","v":0},{"$f":"IF(F17=0,\"\",MAX(F17:I17))","v":93},7,null,null,null,null,{"$f":"IF(ISERROR(VLOOKUP(D17,Namen!A:C,3,0)),\"Z\",VLOOKUP(D17,Namen!A:C,3,0))","v":"m"},{"$f":"IF(ISERROR(VLOOKUP(D17,Namen!A:D,4,0)),\"Z\",VLOOKUP(D17,Namen!A:D,4,0))","v":"ja"},{"$f":"IF(R17=\"ja\",$A$1,0)","v":20},null,null,null,null,22.0093,21,48,47,34]
[{"$f":"IF(ISERROR(RANK(B18,$B$4:$B$203,0)),\"\",RANK(B18,$B$4:$B$203,0))","v":15},{"$f":"IF(COUNT(F18:I18)=1,SUM(F18:I18)-50,IF(COUNT(F18:I18)=2,SUM(F18:I18)-100,IF(COUNT(F18:I18)=3,SUM(F18:I18)-150,IF(COUNT(F18:I18)=4,SUM(F18:I18)-200,\"\"))))","v":20},{"$f":"IF(D18=\"\",\"\",L18)","v":26},"Seiter Franz",{"$f":"IF(ISERROR(VLOOKUP(D18,Namen!A:B,2,0)),\"\",VLOOKUP(D18,Namen!A:B,2,0))","v":"Waltersdorf"},33,70,61,56,{"$f":"IF(D18=0,\"\",SUM(T18:W18))","v":0},{"$f":"IF(F18=0,\"\",MAX(F18:I18))","v":70},26,null,null,null,null,{"$f":"IF(ISERROR(VLOOKUP(D18,Namen!A:C,3,0)),\"Z\",VLOOKUP(D18,Namen!A:C,3,0))","v":"m"},{"$f":"IF(ISERROR(VLOOKUP(D18,Namen!A:D,4,0)),\"Z\",VLOOKUP(D18,Namen!A:D,4,0))","v":"ja"},{"$f":"IF(R18=\"ja\",$A$1,0)","v":20},null,null,null,null,20.007000000000001,6,61,56,33]
[{"$f":"IF(ISERROR(RANK(B19,$B$4:$B$203,0)),\"\",RANK(B19,$B$4:$B$203,0))","v":16},{"$f":"IF(COUNT(F19:I19)=1,SUM(F19:I19)-50,IF(COUNT(F19:I19)=2,SUM(F19:I19)-100,IF(COUNT(F19:I19)=3,SUM(F19:I19)-150,IF(COUNT(F19:I19)=4,SUM(F19:I19)-200,\"\"))))","v":16},{"$f":"IF(D19=\"\",\"\",L19)","v":37},"Kainz Karl",{"$f":"IF(ISERROR(VLOOKUP(D19,Namen!A:B,2,0)),\"\",VLOOKUP(D19,Namen!A:B,2,0))","v":"Obergänserndorf"},46,57,30,83,{"$f":"IF(D19=0,\"\",SUM(T19:W19))","v":0},{"$f":"IF(F19=0,\"\",MAX(F19:I19))","v":83},37,null,null,null,null,{"$f":"IF(ISERROR(VLOOKUP(D19,Namen!A:C,3,0)),\"Z\",VLOOKUP(D19,Namen!A:C,3,0))","v":"m"},{"$f":"IF(ISERROR(VLOOKUP(D19,Namen!A:D,4,0)),\"Z\",VLOOKUP(D19,Namen!A:D,4,0))","v":"ja"},{"$f":"IF(R19=\"ja\",$A$1,0)","v":20},null,null,null,null,16.008299999999998,22,57,46,30]
[{"$f":"IF(ISERROR(RANK(B20,$B$4:$B$203,0)),\"\",RANK(B20,$B$4:$B$203,0))","v":17},{"$f":"IF(COUNT(F20:I20)=1,SUM(F20:I20)-50,IF(COUNT(F20:I20)=2,SUM(F20:I20)-100,IF(COUNT(F20:I20)=3,SUM(F20:I20)-150,IF(COUNT(F20:I20)=4,SUM(F20:I20)-200,\"\"))))","v":15},{"$f":"IF(D20=\"\",\"\",L20)","v":41},"Rosenmayer Paul",{"$f":"IF(ISERROR(VLOOKUP(D20,Namen!A:B,2,0)),\"\",VLOOKUP(D20,Namen!A:B,2,0))","v":"Wien"},42,67,64,42,{"$f":"IF(D20=0,\"\",SUM(T20:W20))","v":0},{"$f":"IF(F20=0,\"\",MAX(F20:I20))","v":67},41,null,null,null,null,{"$f":"IF(ISERROR(VLOOKUP(D20,Namen!A:C,3,0)),\"Z\",VLOOKUP(D20,Namen!A:C,3,0))","v":"m"},{"$f":"IF(ISERROR(VLOOKUP(D20,Namen!A:D,4,0)),\"Z\",VLOOKUP(D20,Namen!A:D,4,0))","v":"ja"},{"$f":"IF(R20=\"ja\",$A$1,0)","v":20},null,null,null,null,15.0067,33,64,42,42]
[{"$f":"IF(ISERROR(RANK(B21,$B$4:$B$203,0)),\"\",RANK(B21,$B$4:$B$203,0))","v":18},{"$f":"IF(COUNT(F21:I21)=1,SUM(F21:I21)-50,IF(COUNT(F21:I21)=2,SUM(F21:I21)-100,IF(COUNT(F21:I21)=3,SUM(F21:I21)-150,IF(COUNT(F21:I21)=4,SUM(F21:I21)-200,\"\"))))","v":14},{"$f":"IF(D21=\"\",\"\",L21)","v":12},"Kaller Johann",{"$f":"IF(ISERROR(VLOOKUP(D21,Namen!A:B,2,0)),\"\",VLOOKUP(D21,Namen!A:B,2,0))","v":"Gerasdorf"},44,58,63,49,{"$f":"IF(D21=0,\"\",SUM(T21:W21))","v":0},{"$f":"IF(F21=0,\"\",MAX(F21:I21))","v":63},12,null,null,null,null,{"$f":"IF(ISERROR(VLOOKUP(D21,Namen!A:C,3,0)),\"Z\",VLOOKUP(D21,Namen!A:C,3,0))","v":"m"},{"$f":"IF(ISERROR(VLOOKUP(D21,Namen!A:D,4,0)),\"Z\",VLOOKUP(D21,Namen!A:D,4,0))","v":"ja"},{"$f":"IF(R21=\"ja\",$A$1,0)","v":20},null,null,null,null,14.0063,15,58,49,44]
[{"$f":"IF(ISERROR(RANK(B22,$B$4:$B$203,0)),\"\",RANK(B22,$B$4:$B$203,0))","v":18},{"$f":"IF(COUNT(F22:I22)=1,SUM(F22:I22)-50,IF(COUNT(F22:I22)=2,SUM(F22:I22)-100,IF(COUNT(F22:I22)=3,SUM(F22:I22)-150,IF(COUNT(F22:I22)=4,SUM(F22:I22)-200,\"\"))))","v":14},{"$f":"IF(D22=\"\",\"\",L22)","v":8},"Schneider Doris",{"$f":"IF(ISERROR(VLOOKUP(D22,Namen!A:B,2,0)),\"\",VLOOKUP(D22,Namen!A:B,2,0))","v":"Dürnkrut"},47,58,48,61,{"$f":"IF(D22=0,\"\",SUM(T22:W22))","v":0},{"$f":"IF(F22=0,\"\",MAX(F22:I22))","v":61},8,null,null,null,null,{"$f":"IF(ISERROR(VLOOKUP(D22,Namen!A:C,3,0)),\"Z\",VLOOKUP(D22,Namen!A:C,3,0))","v":"w"},{"$f":"IF(ISERROR(VLOOKUP(D22,Namen!A:D,4,0)),\"Z\",VLOOKUP(D22,Namen!A:D,4,0))","v":"ja"},{"$f":"IF(R22=\"ja\",$A$1,0)","v":20},null,null,null,null,14.0061,17,58,48,47]
[{"$f":"IF(ISERROR(RANK(B23,$B$4:$B$203,0)),\"\",RANK(B23,$B$4:$B$203,0))","v":20},{"$f":"IF(COUNT(F23:I23)=1,SUM(F23:I23)-50,IF(COUNT(F23:I23)=2,SUM(F23:I23)-100,IF(COUNT(F23:I23)=3,SUM(F23:I23)-150,IF(COUNT(F23:I23)=4,SUM(F23:I23)-200,\"\"))))","v":12},{"$f":"IF(D23=\"\",\"\",L23)","v":48},"Meissl Leo",{"$f":"IF(ISERROR(VLOOKUP(D23,Namen!A:B,2,0)),\"\",VLOOKUP(D23,Namen!A:B,2,0))","v":"Angern"},48,44,82,38,{"$f":"IF(D23=0,\"\",SUM(T23:W23))","v":0},{"$f":"IF(F23=0,\"\",MAX(F23:I23))","v":82},48,null,null,null,null,{"$f":"IF(ISERROR(VLOOKUP(D23,Namen!A:C,3,0)),\"Z\",VLOOKUP(D23,Namen!A:C,3,0))","v":"m"},{"$f":"IF(ISERROR(VLOOKUP(D23,Namen!A:D,4,0)),\"Z\",VLOOKUP(D23,Namen!A:D,4,0))","v":"ja"},{"$f":"IF(R23=\"ja\",$A$1,0)","v":20},null,null,null,null,12.0082,25,48,44,38]
[{"$f":"IF(ISERROR(RANK(B24,$B$4:$B$203,0)),\"\",RANK(B24,$B$4:$B$203,0))","v":21},{"$f":"IF(COUNT(F24:I24)=1,SUM(F24:I24)-50,IF(COUNT(F24:I24)=2,SUM(F24:I24)-100,IF(COUNT(F24:I24)=3,SUM(F24:I24)-150,IF(COUNT(F24:I24)=4,SUM(F24:I24)-200,\"\"))))","v":9},{"$f":"IF(D24=\"\",\"\",L24)","v":18},"Menschik Alfred",{"$f":"IF(ISERROR(VLOOKUP(D24,Namen!A:B,2,0)),\"\",VLOOKUP(D24,Namen!A:B,2,0))","v":"Prottes"},48,80,50,31,{"$f":"IF(D24=0,\"\",SUM(T24:W24))","v":0},{"$f":"IF(F24=0,\"\",MAX(F24:I24))","v":80},18,null,null,null,null,{"$f":"IF(ISERROR(VLOOKUP(D24,Namen!A:C,3,0)),\"Z\",VLOOKUP(D24,Namen!A:C,3,0))","v":"m"},{"$f":"IF(ISERROR(VLOOKUP(D24,Namen!A:D,4,0)),\"Z\",VLOOKUP(D24,Namen!A:D,4,0))","v":"ja"},{"$f":"IF(R24=\"ja\",$A$1,0)","v":20},null,null,null,null,9.0079999999999991,17,50,48,31]
[{"$f":"IF(ISERROR(RANK(B25,$B$4:$B$203,0)),\"\",RANK(B25,$B$4:$B$203,0))","v":22},{"$f":"IF(COUNT(F25:I25)=1,SUM(F25:I25)-50,IF(COUNT(F25:I25)=2,SUM(F25:I25)-100,IF(COUNT(F25:I25)=3,SUM(F25:I25)-150,IF(COUNT(F25:I25)=4,SUM(F25:I25)-200,\"\"))))","v":6},{"$f":"IF(D25=\"\",\"\",L25)","v":39},"Vrzal Roman",{"$f":"IF(ISERROR(VLOOKUP(D25,Namen!A:B,2,0)),\"\",VLOOKUP(D25,Namen!A:B,2,0))","v":"n.n."},48,29,71,58,{"$f":"IF(D25=0,\"\",SUM(T25:W25))","v":0},{"$f":"IF(F25=0,\"\",MAX(F25:I25))","v":71},39,null,null,null,null,{"$f":"IF(ISERROR(VLOOKUP(D25,Namen!A:C,3,0)),\"Z\",VLOOKUP(D25,Namen!A:C,3,0))","v":"m"},{"$f":"IF(ISERROR(VLOOKUP(D25,Namen!A:D,4,0)),\"Z\",VLOOKUP(D25,Namen!A:D,4,0))","v":"ja"},{"$f":"IF(R25=\"ja\",$A$1,0)","v":20},null,null,null,null,6.0071000000000003,17,58,48,29]
[{"$f":"IF(ISERROR(RANK(B26,$B$4:$B$203,0)),\"\",RANK(B26,$B$4:$B$203,0))","v":23},{"$f":"IF(COUNT(F26:I26)=1,SUM(F26:I26)-50,IF(COUNT(F26:I26)=2,SUM(F26:I26)-100,IF(COUNT(F26:I26)=3,SUM(F26:I26)-150,IF(COUNT(F26:I26)=4,SUM(F26:I26)-200,\"\"))))","v":4},{"$f":"IF(D26=\"\",\"\",L26)","v":27},"Wabitsch Josef",{"$f":"IF(ISERROR(VLOOKUP(D26,Namen!A:B,2,0)),\"\",VLOOKUP(D26,Namen!A:B,2,0))","v":"Breitensee"},78,14,48,64,{"$f":"IF(D26=0,\"\",SUM(T26:W26))","v":0},{"$f":"IF(F26=0,\"\",MAX(F26:I26))","v":78},27,null,null,null,null,{"$f":"IF(ISERROR(VLOOKUP(D26,Namen!A:C,3,0)),\"Z\",VLOOKUP(D26,Namen!A:C,3,0))","v":"m"},{"$f":"IF(ISERROR(VLOOKUP(D26,Namen!A:D,4,0)),\"Z\",VLOOKUP(D26,Namen!A:D,4,0))","v":"ja"},{"$f":"IF(R26=\"ja\",$A$1,0)","v":20},null,null,null,null,4.0077999999999996,17,64,48,14]
[{"$f":"IF(ISERROR(RANK(B27,$B$4:$B$203,0)),\"\",RANK(B27,$B$4:$B$203,0))","v":24},{"$f":"IF(COUNT(F27:I27)=1,SUM(F27:I27)-50,IF(COUNT(F27:I27)=2,SUM(F27:I27)-100,IF(COUNT(F27:I27)=3,SUM(F27:I27)-150,IF(COUNT(F27:I27)=4,SUM(F27:I27)-200,\"\"))))","v":2},{"$f":"IF(D27=\"\",\"\",L27)","v":15},"Seltenhammer Leopold",{"$f":"IF(ISERROR(VLOOKUP(D27,Namen!A:B,2,0)),\"\",VLOOKUP(D27,Namen!A:B,2,0))","v":"Rannersdorf"},58,44,38,62,{"$f":"IF(D27=0,\"\",SUM(T27:W27))","v":0},{"$f":"IF(F27=0,\"\",MAX(F27:I27))","v":62},15,null,null,null,null,{"$f":"IF(ISERROR(VLOOKUP(D27,Namen!A:C,3,0)),\"Z\",VLOOKUP(D27,Namen!A:C,3,0))","v":"m"},{"$f":"IF(ISERROR(VLOOKUP(D27,Namen!A:D,4,0)),\"Z\",VLOOKUP(D27,Namen!A:D,4,0))","v":"ja"},{"$f":"IF(R27=\"ja\",$A$1,0)","v":20},null,null,null,null,2.0062000000000002,25,58,44,38]
[{"$f":"IF(ISERROR(RANK(B28,$B$4:$B$203,0)),\"\",RANK(B28,$B$4:$B$203,0))","v":24},{"$f":"IF(COUNT(F28:I28)=1,SUM(F28:I28)-50,IF(COUNT(F28:I28)=2,SUM(F28:I28)-100,IF(COUNT(F28:I28)=3,SUM(F28:I28)-150,IF(COUNT(F28:I28)=4,SUM(F28:I28)-200,\"\"))))","v":2},{"$f":"IF(D28=\"\",\"\",L28)","v":16},"Silberbauer Helmut",{"$f":"IF(ISERROR(VLOOKUP(D28,Namen!A:B,2,0)),\"\",VLOOKUP(D28,Namen!A:B,2,0))","v":"Drösing"},56,62,62,22,{"$f":"IF(D28=0,\"\",SUM(T28:W28))","v":0},{"$f":"IF(F28=0,\"\",MAX(F28:I28))","v":62},16,null,null,null,null,{"$f":"IF(ISERROR(VLOOKUP(D28,Namen!A:C,3,0)),\"Z\",VLOOKUP(D28,Namen!A:C,3,0))","v":"m"},{"$f":"IF(ISERROR(VLOOKUP(D28,Namen!A:D,4,0)),\"Z\",VLOOKUP(D28,Namen!A:D,4,0))","v":"ja"},{"$f":"IF(R28=\"ja\",$A$1,0)","v":20},null,null,null,null,2.0062000000000002,6,62,56,22]
[{"$f":"IF(ISERROR(RANK(B29,$B$4:$B$203,0)),\"\",RANK(B29,$B$4:$B$203,0))","v":26},{"$f":"IF(COUNT(F29:I29)=1,SUM(F29:I29)-50,IF(COUNT(F29:I29)=2,SUM(F29:I29)-100,IF(COUNT(F29:I29)=3,SUM(F29:I29)-150,IF(COUNT(F29:I29)=4,SUM(F29:I29)-200,\"\"))))","v":-4},{"$f":"IF(D29=\"\",\"\",L29)","v":42},"Huber Karl",{"$f":"IF(ISERROR(VLOOKUP(D29,Namen!A:B,2,0)),\"\",VLOOKUP(D29,Namen!A:B,2,0))","v":"Ringelsdorf"},83,43,58,12,{"$f":"IF(D29=0,\"\",SUM(T29:W29))","v":0},{"$f":"IF(F29=0,\"\",MAX(F29:I29))","v":83},42,null,null,null,null,{"$f":"IF(ISERROR(VLOOKUP(D29,Namen!A:C,3,0)),\"Z\",VLOOKUP(D29,Namen!A:C,3,0))","v":"m"},{"$f":"IF(ISERROR(VLOOKUP(D29,Namen!A:D,4,0)),\"Z\",VLOOKUP(D29,Namen!A:D,4,0))","v":"ja"},{"$f":"IF(R29=\"ja\",$A$1,0)","v":20},null,null,null,null,-3.9916999999999998,28,58,43,12]
[{"$f":"IF(ISERROR(RANK(B30,$B$4:$B$203,0)),\"\",RANK(B30,$B$4:$B$203,0))","v":27},{"$f":"IF(COUNT(F30:I30)=1,SUM(F30:I30)-50,IF(COUNT(F30:I30)=2,SUM(F30:I30)-100,IF(COUNT(F30:I30)=3,SUM(F30:I30)-150,IF(COUNT(F30:I30)=4,SUM(F30:I30)-200,\"\"))))","v":-5},56,"Schubtschik Wilhelm","Hohenau",60,45,48,42,{"$f":"IF(D30=0,\"\",SUM(T30:W30))","v":0},{"$f":"IF(F30=0,\"\",MAX(F30:I30))","v":60},56,null,null,null,null,{"$f":"IF(ISERROR(VLOOKUP(D30,Namen!A:C,3,0)),\"Z\",VLOOKUP(D30,Namen!A:C,3,0))","v":"m"},{"$f":"IF(ISERROR(VLOOKUP(D30,Namen!A:D,4,0)),\"Z\",VLOOKUP(D30,Namen!A:D,4,0))","v":"ja"},{"$f":"IF(R30=\"ja\",$A$1,0)","v":20},null,null,null,null,-4.9939999999999998,24,48,45,42]
[{"$f":"IF(ISERROR(RANK(B31,$B$4:$B$203,0)),\"\",RANK(B31,$B$4:$B$203,0))","v":28},{"$f":"IF(COUNT(F31:I31)=1,SUM(F31:I31)-50,IF(COUNT(F31:I31)=2,SUM(F31:I31)-100,IF(COUNT(F31:I31)=3,SUM(F31:I31)-150,IF(COUNT(F31:I31)=4,SUM(F31:I31)-200,\"\"))))","v":-6},{"$f":"IF(D31=\"\",\"\",L31)","v":21},"Gaida Herbert",{"$f":"IF(ISERROR(VLOOKUP(D31,Namen!A:B,2,0)),\"\",VLOOKUP(D31,Namen!A:B,2,0))","v":"Hohenau"},20,68,72,34,{"$f":"IF(D31=0,\"\",SUM(T31:W31))","v":0},{"$f":"IF(F31=0,\"\",MAX(F31:I31))","v":72},21,null,null,null,null,{"$f":"IF(ISERROR(VLOOKUP(D31,Namen!A:C,3,0)),\"Z\",VLOOKUP(D31,Namen!A:C,3,0))","v":"m"},{"$f":"IF(ISERROR(VLOOKUP(D31,Namen!A:D,4,0)),\"Z\",VLOOKUP(D31,Namen!A:D,4,0))","v":"ja"},{"$f":"IF(R31=\"ja\",$A$1,0)","v":20},null,null,null,null,-5.9927999999999999,47,68,34,20]
[{"$f":"IF(ISERROR(RANK(B32,$B$4:$B$203,0)),\"\",RANK(B32,$B$4:$B$203,0))","v":29},{"$f":"IF(COUNT(F32:I32)=1,SUM(F32:I32)-50,IF(COUNT(F32:I32)=2,SUM(F32:I32)-100,IF(COUNT(F32:I32)=3,SUM(F32:I32)-150,IF(COUNT(F32:I32)=4,SUM(F32:I32)-200,\"\"))))","v":-7},{"$f":"IF(D32=\"\",\"\",L32)","v":30},"Schwalm Josef",{"$f":"IF(ISERROR(VLOOKUP(D32,Namen!A:B,2,0)),\"\",VLOOKUP(D32,Namen!A:B,2,0))","v":"Hausbrunn"},35,21,54,83,{"$f":"IF(D32=0,\"\",SUM(T32:W32))","v":0},{"$f":"IF(F32=0,\"\",MAX(F32:I32))","v":83},30,null,null,null,null,{"$f":"IF(ISERROR(VLOOKUP(D32,Namen!A:C,3,0)),\"Z\",VLOOKUP(D32,Namen!A:C,3,0))","v":"m"},{"$f":"IF(ISERROR(VLOOKUP(D32,Namen!A:D,4,0)),\"Z\",VLOOKUP(D32,Namen!A:D,4,0))","v":"ja"},{"$f":"IF(R32=\"ja\",$A$1,0)","v":20},null,null,null,null,-6.9916999999999998,46,54,35,21]
[{"$f":"IF(ISERROR(RANK(B33,$B$4:$B$203,0)),\"\",RANK(B33,$B$4:$B$203,0))","v":30},{"$f":"IF(COUNT(F33:I33)=1,SUM(F33:I33)-50,IF(COUNT(F33:I33)=2,SUM(F33:I33)-100,IF(COUNT(F33:I33)=3,SUM(F33:I33)-150,IF(COUNT(F33:I33)=4,SUM(F33:I33)-200,\"\"))))","v":-9},{"$f":"IF(D33=\"\",\"\",L33)","v":35},"Huber Franz",{"$f":"IF(ISERROR(VLOOKUP(D33,Namen!A:B,2,0)),\"\",VLOOKUP(D33,Namen!A:B,2,0))","v":"Großkrut"},56,35,36,64,{"$f":"IF(D33=0,\"\",SUM(T33:W33))","v":0},{"$f":"IF(F33=0,\"\",MAX(F33:I33))","v":64},35,null,null,null,null,{"$f":"IF(ISERROR(VLOOKUP(D33,Namen!A:C,3,0)),\"Z\",VLOOKUP(D33,Namen!A:C,3,0))","v":"m"},{"$f":"IF(ISERROR(VLOOKUP(D33,Namen!A:D,4,0)),\"Z\",VLOOKUP(D33,Namen!A:D,4,0))","v":"ja"},{"$f":"IF(R33=\"ja\",$A$1,0)","v":20},null,null,null,null,-8.9936000000000007,43,56,36,35]
[{"$f":"IF(ISERROR(RANK(B34,$B$4:$B$203,0)),\"\",RANK(B34,$B$4:$B$203,0))","v":31},{"$f":"IF(COUNT(F34:I34)=1,SUM(F34:I34)-50,IF(COUNT(F34:I34)=2,SUM(F34:I34)-100,IF(COUNT(F34:I34)=3,SUM(F34:I34)-150,IF(COUNT(F34:I34)=4,SUM(F34:I34)-200,\"\"))))","v":-10},{"$f":"IF(D34=\"\",\"\",L34)","v":51},"Winter Josef",{"$f":"IF(ISERROR(VLOOKUP(D34,Namen!A:B,2,0)),\"\",VLOOKUP(D34,Namen!A:B,2,0))","v":"Obersulz"},32,43,62,53,{"$f":"IF(D34=0,\"\",SUM(T34:W34))","v":0},{"$f":"IF(F34=0,\"\",MAX(F34:I34))","v":62},51,null,null,null,null,{"$f":"IF(ISERROR(VLOOKUP(D34,Namen!A:C,3,0)),\"Z\",VLOOKUP(D34,Namen!A:C,3,0))","v":"m"},{"$f":"IF(ISERROR(VLOOKUP(D34,Namen!A:D,4,0)),\"Z\",VLOOKUP(D34,Namen!A:D,4,0))","v":"ja"},{"$f":"IF(R34=\"ja\",$A$1,0)","v":20},null,null,null,null,-9.9938000000000002,28,53,43,32]
[{"$f":"IF(ISERROR(RANK(B35,$B$4:$B$203,0)),\"\",RANK(B35,$B$4:$B$203,0))","v":31},{"$f":"IF(COUNT(F35:I35)=1,SUM(F35:I35)-50,IF(COUNT(F35:I35)=2,SUM(F35:I35)-100,IF(COUNT(F35:I35)=3,SUM(F35:I35)-150,IF(COUNT(F35:I35)=4,SUM(F35:I35)-200,\"\"))))","v":-10},{"$f":"IF(D35=\"\",\"\",L35)","v":50},"Lautenbach Adolf",{"$f":"IF(ISERROR(VLOOKUP(D35,Namen!A:B,2,0)),\"\",VLOOKUP(D35,Namen!A:B,2,0))","v":"Hohenau"},55,34,46,55,{"$f":"IF(D35=0,\"\",SUM(T35:W35))","v":0},{"$f":"IF(F35=0,\"\",MAX(F35:I35))","v":55},50,null,null,null,null,{"$f":"IF(ISERROR(VLOOKUP(D35,Namen!A:C,3,0)),\"Z\",VLOOKUP(D35,Namen!A:C,3,0))","v":"m"},{"$f":"IF(ISERROR(VLOOKUP(D35,Namen!A:D,4,0)),\"Z\",VLOOKUP(D35,Namen!A:D,4,0))","v":"ja"},{"$f":"IF(R35=\"ja\",$A$1,0)","v":20},null,null,null,null,-9.9945000000000004,22,55,46,34]
[{"$f":"IF(ISERROR(RANK(B36,$B$4:$B$203,0)),\"\",RANK(B36,$B$4:$B$203,0))","v":33},{"$f":"IF(COUNT(F36:I36)=1,SUM(F36:I36)-50,IF(COUNT(F36:I36)=2,SUM(F36:I36)-100,IF(COUNT(F36:I36)=3,SUM(F36:I36)-150,IF(COUNT(F36:I36)=4,SUM(F36:I36)-200,\"\"))))","v":-11},{"$f":"IF(D36=\"\",\"\",L36)","v":52},"Hornyak Gabi",{"$f":"IF(ISERROR(VLOOKUP(D36,Namen!A:B,2,0)),\"\",VLOOKUP(D36,Namen!A:B,2,0))","v":"Nexing"},70,27,39,53,{"$f":"IF(D36=0,\"\",SUM(T36:W36))","v":0},{"$f":"IF(F36=0,\"\",MAX(F36:I36))","v":70},52,null,null,null,null,{"$f":"IF(ISERROR(VLOOKUP(D36,Namen!A:C,3,0)),\"Z\",VLOOKUP(D36,Namen!A:C,3,0))","v":"w"},{"$f":"IF(ISERROR(VLOOKUP(D36,Namen!A:D,4,0)),\"Z\",VLOOKUP(D36,Namen!A:D,4,0))","v":"ja"},{"$f":"IF(R36=\"ja\",$A$1,0)","v":20},null,null,null,null,-10.993,40,53,39,27]
[{"$f":"IF(ISERROR(RANK(B37,$B$4:$B$203,0)),\"\",RANK(B37,$B$4:$B$203,0))","v":34},{"$f":"IF(COUNT(F37:I37)=1,SUM(F37:I37)-50,IF(COUNT(F37:I37)=2,SUM(F37:I37)-100,IF(COUNT(F37:I37)=3,SUM(F37:I37)-150,IF(COUNT(F37:I37)=4,SUM(F37:I37)-200,\"\"))))","v":-16},{"$f":"IF(D37=\"\",\"\",L37)","v":25},"Bayer Ernst",{"$f":"IF(ISERROR(VLOOKUP(D37,Namen!A:B,2,0)),\"\",VLOOKUP(D37,Namen!A:B,2,0))","v":"Hohenau"},62,28,38,56,{"$f":"IF(D37=0,\"\",SUM(T37:W37))","v":0},{"$f":"IF(F37=0,\"\",MAX(F37:I37))","v":62},25,null,null,null,null,{"$f":"IF(ISERROR(VLOOKUP(D37,Namen!A:C,3,0)),\"Z\",VLOOKUP(D37,Namen!A:C,3,0))","v":"m"},{"$f":"IF(ISERROR(VLOOKUP(D37,Namen!A:D,4,0)),\"Z\",VLOOKUP(D37,Namen!A:D,4,0))","v":"ja"},{"$f":"IF(R37=\"ja\",$A$1,0)","v":20},null,null,null,null,-15.9938,41,56,38,28]
[{"$f":"IF(ISERROR(RANK(B38,$B$4:$B$203,0)),\"\",RANK(B38,$B$4:$B$203,0))","v":34},{"$f":"IF(COUNT(F38:I38)=1,SUM(F38:I38)-50,IF(COUNT(F38:I38)=2,SUM(F38:I38)-100,IF(COUNT(F38:I38)=3,SUM(F38:I38)-150,IF(COUNT(F38:I38)=4,SUM(F38:I38)-200,\"\"))))","v":-16},{"$f":"IF(D38=\"\",\"\",L38)","v":5},"Mraz Egon",{"$f":"IF(ISERROR(VLOOKUP(D38,Namen!A:B,2,0)),\"\",VLOOKUP(D38,Namen!A:B,2,0))","v":"Breitensee"},50,51,40,43,{"$f":"IF(D38=0,\"\",SUM(T38:W38))","v":0},{"$f":"IF(F38=0,\"\",MAX(F38:I38))","v":51},5,null,null,null,null,{"$f":"IF(ISERROR(VLOOKUP(D38,Namen!A:C,3,0)),\"Z\",VLOOKUP(D38,Namen!A:C,3,0))","v":"m"},{"$f":"IF(ISERROR(VLOOKUP(D38,Namen!A:D,4,0)),\"Z\",VLOOKUP(D38,Namen!A:D,4,0))","v":"ja"},{"$f":"IF(R38=\"ja\",$A$1,0)","v":20},null,null,null,null,-15.994899999999999,28,50,43,40]
[{"$f":"IF(ISERROR(RANK(B39,$B$4:$B$203,0)),\"\",RANK(B39,$B$4:$B$203,0))","v":36},{"$f":"IF(COUNT(F39:I39)=1,SUM(F39:I39)-50,IF(COUNT(F39:I39)=2,SUM(F39:I39)-100,IF(COUNT(F39:I39)=3,SUM(F39:I39)-150,IF(COUNT(F39:I39)=4,SUM(F39:I39)-200,\"\"))))","v":-18},{"$f":"IF(D39=\"\",\"\",L39)","v":45},"Rabenreither Johann",{"$f":"IF(ISERROR(VLOOKUP(D39,Namen!A:B,2,0)),\"\",VLOOKUP(D39,Namen!A:B,2,0))","v":"Schrick"},51,57,21,53,{"$f":"IF(D39=0,\"\",SUM(T39:W39))","v":0},{"$f":"IF(F39=0,\"\",MAX(F39:I39))","v":57},45,null,null,null,null,{"$f":"IF(ISERROR(VLOOKUP(D39,Namen!A:C,3,0)),\"Z\",VLOOKUP(D39,Namen!A:C,3,0))","v":"m"},{"$f":"IF(ISERROR(VLOOKUP(D39,Namen!A:D,4,0)),\"Z\",VLOOKUP(D39,Namen!A:D,4,0))","v":"ja"},{"$f":"IF(R39=\"ja\",$A$1,0)","v":20},null,null,null,null,-17.994299999999999,12,53,51,21]
[{"$f":"IF(ISERROR(RANK(B40,$B$4:$B$203,0)),\"\",RANK(B40,$B$4:$B$203,0))","v":37},{"$f":"IF(COUNT(F40:I40)=1,SUM(F40:I40)-50,IF(COUNT(F40:I40)=2,SUM(F40:I40)-100,IF(COUNT(F40:I40)=3,SUM(F40:I40)-150,IF(COUNT(F40:I40)=4,SUM(F40:I40)-200,\"\"))))","v":-20},{"$f":"IF(D40=\"\",\"\",L40)","v":54},"Kaltenbrunner Leo",{"$f":"IF(ISERROR(VLOOKUP(D40,Namen!A:B,2,0)),\"\",VLOOKUP(D40,Namen!A:B,2,0))","v":"Obergänserndorf"},24,69,57,30,{"$f":"IF(D40=0,\"\",SUM(T40:W40))","v":0},{"$f":"IF(F40=0,\"\",MAX(F40:I40))","v":69},54,null,null,null,null,{"$f":"IF(ISERROR(VLOOKUP(D40,Namen!A:C,3,0)),\"Z\",VLOOKUP(D40,Namen!A:C,3,0))","v":"m"},{"$f":"IF(ISERROR(VLOOKUP(D40,Namen!A:D,4,0)),\"Z\",VLOOKUP(D40,Namen!A:D,4,0))","v":"ja"},{"$f":"IF(R40=\"ja\",$A$1,0)","v":20},null,null,null,null,-19.993099999999998,48,57,30,24]
[{"$f":"IF(ISERROR(RANK(B41,$B$4:$B$203,0)),\"\",RANK(B41,$B$4:$B$203,0))","v":38},{"$f":"IF(COUNT(F41:I41)=1,SUM(F41:I41)-50,IF(COUNT(F41:I41)=2,SUM(F41:I41)-100,IF(COUNT(F41:I41)=3,SUM(F41:I41)-150,IF(COUNT(F41:I41)=4,SUM(F41:I41)-200,\"\"))))","v":-23},{"$f":"IF(D41=\"\",\"\",L41)","v":24},"Höger Anton",{"$f":"IF(ISERROR(VLOOKUP(D41,Namen!A:B,2,0)),\"\",VLOOKUP(D41,Namen!A:B,2,0))","v":"Raggendorf"},49,58,21,49,{"$f":"IF(D41=0,\"\",SUM(T41:W41))","v":0},{"$f":"IF(F41=0,\"\",MAX(F41:I41))","v":58},24,null,null,null,null,{"$f":"IF(ISERROR(VLOOKUP(D41,Namen!A:C,3,0)),\"Z\",VLOOKUP(D41,Namen!A:C,3,0))","v":"m"},{"$f":"IF(ISERROR(VLOOKUP(D41,Namen!A:D,4,0)),\"Z\",VLOOKUP(D41,Namen!A:D,4,0))","v":"ja"},{"$f":"IF(R41=\"ja\",$A$1,0)","v":20},null,null,null,null,{"$f":"IFERROR(B41+(K41*0.0001),\"\")","v":-22.994199999999999},15,49,49,21]
[{"$f":"IF(ISERROR(RANK(B42,$B$4:$B$203,0)),\"\",RANK(B42,$B$4:$B$203,0))","v":39},{"$f":"IF(COUNT(F42:I42)=1,SUM(F42:I42)-50,IF(COUNT(F42:I42)=2,SUM(F42:I42)-100,IF(COUNT(F42:I42)=3,SUM(F42:I42)-150,IF(COUNT(F42:I42)=4,SUM(F42:I42)-200,\"\"))))","v":-25},{"$f":"IF(D42=\"\",\"\",L42)","v":1},"Mokesch Ewald",{"$f":"IF(ISERROR(VLOOKUP(D42,Namen!A:B,2,0)),\"\",VLOOKUP(D42,Namen!A:B,2,0))","v":"Rabensburg"},72,43,42,18,{"$f":"IF(D42=0,\"\",SUM(T42:W42))","v":0},{"$f":"IF(F42=0,\"\",MAX(F42:I42))","v":72},1,null,null,null,null,{"$f":"IF(ISERROR(VLOOKUP(D42,Namen!A:C,3,0)),\"Z\",VLOOKUP(D42,Namen!A:C,3,0))","v":"m"},{"$f":"IF(ISERROR(VLOOKUP(D42,Namen!A:D,4,0)),\"Z\",VLOOKUP(D42,Namen!A:D,4,0))","v":"ja"},{"$f":"IF(R42=\"ja\",$A$1,0)","v":20},null,null,null,null,{"$f":"IFERROR(B42+(K42*0.0001),\"\")","v":-24.992799999999999},33,43,42,18]
[{"$f":"IF(ISERROR(RANK(B43,$B$4:$B$203,0)),\"\",RANK(B43,$B$4:$B$203,0))","v":39},{"$f":"IF(COUNT(F43:I43)=1,SUM(F43:I43)-50,IF(COUNT(F43:I43)=2,SUM(F43:I43)-100,IF(COUNT(F43:I43)=3,SUM(F43:I43)-150,IF(COUNT(F43:I43)=4,SUM(F43:I43)-200,\"\"))))","v":-25},{"$f":"IF(D43=\"\",\"\",L43)","v":36},"Kressnik Matthias",{"$f":"IF(ISERROR(VLOOKUP(D43,Namen!A:B,2,0)),\"\",VLOOKUP(D43,Namen!A:B,2,0))","v":"Angern"},40,47,33,55,{"$f":"IF(D43=0,\"\",SUM(T43:W43))","v":0},{"$f":"IF(F43=0,\"\",MAX(F43:I43))","v":55},36,null,null,null,null,{"$f":"IF(ISERROR(VLOOKUP(D43,Namen!A:C,3,0)),\"Z\",VLOOKUP(D43,Namen!A:C,3,0))","v":"m"},{"$f":"IF(ISERROR(VLOOKUP(D43,Namen!A:D,4,0)),\"Z\",VLOOKUP(D43,Namen!A:D,4,0))","v":"ja"},{"$f":"IF(R43=\"ja\",$A$1,0)","v":20},null,null,null,null,-24.994499999999999,37,47,40,33]
[{"$f":"IF(ISERROR(RANK(B44,$B$4:$B$203,0)),\"\",RANK(B44,$B$4:$B$203,0))","v":41},{"$f":"IF(COUNT(F44:I44)=1,SUM(F44:I44)-50,IF(COUNT(F44:I44)=2,SUM(F44:I44)-100,IF(COUNT(F44:I44)=3,SUM(F44:I44)-150,IF(COUNT(F44:I44)=4,SUM(F44:I44)-200,\"\"))))","v":-26},{"$f":"IF(D44=\"\",\"\",L44)","v":55},"Kainz Günther",{"$f":"IF(ISERROR(VLOOKUP(D44,Namen!A:B,2,0)),\"\",VLOOKUP(D44,Namen!A:B,2,0))","v":"Korneuburg"},51,37,42,44,{"$f":"IF(D44=0,\"\",SUM(T44:W44))","v":0},{"$f":"IF(F44=0,\"\",MAX(F44:I44))","v":51},55,null,null,null,null,{"$f":"IF(ISERROR(VLOOKUP(D44,Namen!A:C,3,0)),\"Z\",VLOOKUP(D44,Namen!A:C,3,0))","v":"m"},{"$f":"IF(ISERROR(VLOOKUP(D44,Namen!A:D,4,0)),\"Z\",VLOOKUP(D44,Namen!A:D,4,0))","v":"ja"},{"$f":"IF(R44=\"ja\",$A$1,0)","v":20},null,null,null,null,-25.994900000000001,33,44,42,37]
[{"$f":"IF(ISERROR(RANK(B45,$B$4:$B$203,0)),\"\",RANK(B45,$B$4:$B$203,0))","v":42},{"$f":"IF(COUNT(F45:I45)=1,SUM(F45:I45)-50,IF(COUNT(F45:I45)=2,SUM(F45:I45)-100,IF(COUNT(F45:I45)=3,SUM(F45:I45)-150,IF(COUNT(F45:I45)=4,SUM(F45:I45)-200,\"\"))))","v":-27},2,"Zdrahal Andrea",{"$f":"IF(ISERROR(VLOOKUP(D45,Namen!A:B,2,0)),\"\",VLOOKUP(D45,Namen!A:B,2,0))","v":"Hohenau"},36,39,26,72,{"$f":"IF(D45=0,\"\",SUM(T45:W45))","v":0},{"$f":"IF(F45=0,\"\",MAX(F45:I45))","v":72},2,null,null,null,null,{"$f":"IF(ISERROR(VLOOKUP(D45,Namen!A:C,3,0)),\"Z\",VLOOKUP(D45,Namen!A:C,3,0))","v":"w"},{"$f":"IF(ISERROR(VLOOKUP(D45,Namen!A:D,4,0)),\"Z\",VLOOKUP(D45,Namen!A:D,4,0))","v":"ja"},{"$f":"IF(R45=\"ja\",$A$1,0)","v":20},null,null,null,null,-26.992799999999999,43,39,36,26]
[{"$f":"IF(ISERROR(RANK(B46,$B$4:$B$203,0)),\"\",RANK(B46,$B$4:$B$203,0))","v":43},{"$f":"IF(COUNT(F46:I46)=1,SUM(F46:I46)-50,IF(COUNT(F46:I46)=2,SUM(F46:I46)-100,IF(COUNT(F46:I46)=3,SUM(F46:I46)-150,IF(COUNT(F46:I46)=4,SUM(F46:I46)-200,\"\"))))","v":-29},{"$f":"IF(D46=\"\",\"\",L46)","v":43},"Srba Andreas",{"$f":"IF(ISERROR(VLOOKUP(D46,Namen!A:B,2,0)),\"\",VLOOKUP(D46,Namen!A:B,2,0))","v":"Angern"},41,34,55,41,{"$f":"IF(D46=0,\"\",SUM(T46:W46))","v":0},{"$f":"IF(F46=0,\"\",MAX(F46:I46))","v":55},43,null,null,null,null,{"$f":"IF(ISERROR(VLOOKUP(D46,Namen!A:C,3,0)),\"Z\",VLOOKUP(D46,Namen!A:C,3,0))","v":"m"},{"$f":"IF(ISERROR(VLOOKUP(D46,Namen!A:D,4,0)),\"Z\",VLOOKUP(D46,Namen!A:D,4,0))","v":"ja"},{"$f":"IF(R46=\"ja\",$A$1,0)","v":20},null,null,null,null,-28.994499999999999,36,41,41,34]
[{"$f":"IF(ISERROR(RANK(B47,$B$4:$B$203,0)),\"\",RANK(B47,$B$4:$B$203,0))","v":44},{"$f":"IF(COUNT(F47:I47)=1,SUM(F47:I47)-50,IF(COUNT(F47:I47)=2,SUM(F47:I47)-100,IF(COUNT(F47:I47)=3,SUM(F47:I47)-150,IF(COUNT(F47:I47)=4,SUM(F47:I47)-200,\"\"))))","v":-30},{"$f":"IF(D47=\"\",\"\",L47)","v":14},"Turetschek Alfred",{"$f":"IF(ISERROR(VLOOKUP(D47,Namen!A:B,2,0)),\"\",VLOOKUP(D47,Namen!A:B,2,0))","v":"Waltersdorf"},55,51,40,24,{"$f":"IF(D47=0,\"\",SUM(T47:W47))","v":0},{"$f":"IF(F47=0,\"\",MAX(F47:I47))","v":55},14,null,null,null,null,{"$f":"IF(ISERROR(VLOOKUP(D47,Namen!A:C,3,0)),\"Z\",VLOOKUP(D47,Namen!A:C,3,0))","v":"m"},{"$f":"IF(ISERROR(VLOOKUP(D47,Namen!A:D,4,0)),\"Z\",VLOOKUP(D47,Namen!A:D,4,0))","v":"ja"},{"$f":"IF(R47=\"ja\",$A$1,0)","v":20},null,null,null,null,-29.994499999999999,37,51,40,24]
[{"$f":"IF(ISERROR(RANK(B48,$B$4:$B$203,0)),\"\",RANK(B48,$B$4:$B$203,0))","v":45},{"$f":"IF(COUNT(F48:I48)=1,SUM(F48:I48)-50,IF(COUNT(F48:I48)=2,SUM(F48:I48)-100,IF(COUNT(F48:I48)=3,SUM(F48:I48)-150,IF(COUNT(F48:I48)=4,SUM(F48:I48)-200,\"\"))))","v":-39},{"$f":"IF(D48=\"\",\"\",L48)","v":44},"Lehner Johann",{"$f":"IF(ISERROR(VLOOKUP(D48,Namen!A:B,2,0)),\"\",VLOOKUP(D48,Namen!A:B,2,0))","v":"Schrick"},24,89,8,40,{"$f":"IF(D48=0,\"\",SUM(T48:W48))","v":0},{"$f":"IF(F48=0,\"\",MAX(F48:I48))","v":89},44,null,null,null,null,{"$f":"IF(ISERROR(VLOOKUP(D48,Namen!A:C,3,0)),\"Z\",VLOOKUP(D48,Namen!A:C,3,0))","v":"m"},{"$f":"IF(ISERROR(VLOOKUP(D48,Namen!A:D,4,0)),\"Z\",VLOOKUP(D48,Namen!A:D,4,0))","v":"ja"},{"$f":"IF(R48=\"ja\",$A$1,0)","v":20},null,null,null,null,-38.991100000000003,52,40,24,8]
[{"$f":"IF(ISERROR(RANK(B49,$B$4:$B$203,0)),\"\",RANK(B49,$B$4:$B$203,0))","v":46},{"$f":"IF(COUNT(F49:I49)=1,SUM(F49:I49)-50,IF(COUNT(F49:I49)=2,SUM(F49:I49)-100,IF(COUNT(F49:I49)=3,SUM(F49:I49)-150,IF(COUNT(F49:I49)=4,SUM(F49:I49)-200,\"\"))))","v":-40},{"$f":"IF(D49=\"\",\"\",L49)","v":33},"Wiedermann Monika",{"$f":"IF(ISERROR(VLOOKUP(D49,Namen!A:B,2,0)),\"\",VLOOKUP(D49,Namen!A:B,2,0))","v":"Hausbrunn"},1,44,52,63,{"$f":"IF(D49=0,\"\",SUM(T49:W49))","v":0},{"$f":"IF(F49=0,\"\",MAX(F49:I49))","v":63},33,null,null,null,null,{"$f":"IF(ISERROR(VLOOKUP(D49,Namen!A:C,3,0)),\"Z\",VLOOKUP(D49,Namen!A:C,3,0))","v":"w"},{"$f":"IF(ISERROR(VLOOKUP(D49,Namen!A:D,4,0)),\"Z\",VLOOKUP(D49,Namen!A:D,4,0))","v":"ja"},{"$f":"IF(R49=\"ja\",$A$1,0)","v":20},null,null,null,null,-39.993699999999997,25,52,44,1]
[{"$f":"IF(ISERROR(RANK(B50,$B$4:$B$203,0)),\"\",RANK(B50,$B$4:$B$203,0))","v":47},{"$f":"IF(COUNT(F50:I50)=1,SUM(F50:I50)-50,IF(COUNT(F50:I50)=2,SUM(F50:I50)-100,IF(COUNT(F50:I50)=3,SUM(F50:I50)-150,IF(COUNT(F50:I50)=4,SUM(F50:I50)-200,\"\"))))","v":-43},{"$f":"IF(D50=\"\",\"\",L50)","v":17},"Köck Helmut",{"$f":"IF(ISERROR(VLOOKUP(D50,Namen!A:B,2,0)),\"\",VLOOKUP(D50,Namen!A:B,2,0))","v":"Niederabsdorf"},19,30,80,28,{"$f":"IF(D50=0,\"\",SUM(T50:W50))","v":0},{"$f":"IF(F50=0,\"\",MAX(F50:I50))","v":80},17,null,null,null,null,{"$f":"IF(ISERROR(VLOOKUP(D50,Namen!A:C,3,0)),\"Z\",VLOOKUP(D50,Namen!A:C,3,0))","v":"m"},{"$f":"IF(ISERROR(VLOOKUP(D50,Namen!A:D,4,0)),\"Z\",VLOOKUP(D50,Namen!A:D,4,0))","v":"ja"},{"$f":"IF(R50=\"ja\",$A$1,0)","v":20},null,null,null,null,-42.991999999999997,50,30,28,19]
[{"$f":"IF(ISERROR(RANK(B51,$B$4:$B$203,0)),\"\",RANK(B51,$B$4:$B$203,0))","v":47},{"$f":"IF(COUNT(F51:I51)=1,SUM(F51:I51)-50,IF(COUNT(F51:I51)=2,SUM(F51:I51)-100,IF(COUNT(F51:I51)=3,SUM(F51:I51)-150,IF(COUNT(F51:I51)=4,SUM(F51:I51)-200,\"\"))))","v":-43},{"$f":"IF(D51=\"\",\"\",L51)","v":6},"Müllner Otto",{"$f":"IF(ISERROR(VLOOKUP(D51,Namen!A:B,2,0)),\"\",VLOOKUP(D51,Namen!A:B,2,0))","v":"Grub"},62,37,8,50,{"$f":"IF(D51=0,\"\",SUM(T51:W51))","v":0},{"$f":"IF(F51=0,\"\",MAX(F51:I51))","v":62},6,null,null,null,null,{"$f":"IF(ISERROR(VLOOKUP(D51,Namen!A:C,3,0)),\"Z\",VLOOKUP(D51,Namen!A:C,3,0))","v":"m"},{"$f":"IF(ISERROR(VLOOKUP(D51,Namen!A:D,4,0)),\"Z\",VLOOKUP(D51,Namen!A:D,4,0))","v":"ja"},{"$f":"IF(R51=\"ja\",$A$1,0)","v":20},null,null,null,null,-42.9938,42,50,37,8]
[{"$f":"IF(ISERROR(RANK(B52,$B$4:$B$203,0)),\"\",RANK(B52,$B$4:$B$203,0))","v":49},{"$f":"IF(COUNT(F52:I52)=1,SUM(F52:I52)-50,IF(COUNT(F52:I52)=2,SUM(F52:I52)-100,IF(COUNT(F52:I52)=3,SUM(F52:I52)-150,IF(COUNT(F52:I52)=4,SUM(F52:I52)-200,\"\"))))","v":-50},{"$f":"IF(D52=\"\",\"\",L52)","v":31},"Scharinger Herbert",{"$f":"IF(ISERROR(VLOOKUP(D52,Namen!A:B,2,0)),\"\",VLOOKUP(D52,Namen!A:B,2,0))","v":"Hausbrunn"},52,43,25,30,{"$f":"IF(D52=0,\"\",SUM(T52:W52))","v":0},{"$f":"IF(F52=0,\"\",MAX(F52:I52))","v":52},31,null,null,null,null,{"$f":"IF(ISERROR(VLOOKUP(D52,Namen!A:C,3,0)),\"Z\",VLOOKUP(D52,Namen!A:C,3,0))","v":"m"},{"$f":"IF(ISERROR(VLOOKUP(D52,Namen!A:D,4,0)),\"Z\",VLOOKUP(D52,Namen!A:D,4,0))","v":"ja"},{"$f":"IF(R52=\"ja\",$A$1,0)","v":20},null,null,null,null,-49.994799999999998,48,43,30,25]
[{"$f":"IF(ISERROR(RANK(B53,$B$4:$B$203,0)),\"\",RANK(B53,$B$4:$B$203,0))","v":50},{"$f":"IF(COUNT(F53:I53)=1,SUM(F53:I53)-50,IF(COUNT(F53:I53)=2,SUM(F53:I53)-100,IF(COUNT(F53:I53)=3,SUM(F53:I53)-150,IF(COUNT(F53:I53)=4,SUM(F53:I53)-200,\"\"))))","v":-54},{"$f":"IF(D53=\"\",\"\",L53)","v":4},"Wiesinger Walter",{"$f":"IF(ISERROR(VLOOKUP(D53,Namen!A:B,2,0)),\"\",VLOOKUP(D53,Namen!A:B,2,0))","v":"Gaweinstal"},51,-3,40,58,{"$f":"IF(D53=0,\"\",SUM(T53:W53))","v":50},{"$f":"IF(F53=0,\"\",MAX(F53:I53))","v":58},4,null,null,null,null,{"$f":"IF(ISERROR(VLOOKUP(D53,Namen!A:C,3,0)),\"Z\",VLOOKUP(D53,Namen!A:C,3,0))","v":"m"},{"$f":"IF(ISERROR(VLOOKUP(D53,Namen!A:D,4,0)),\"Z\",VLOOKUP(D53,Namen!A:D,4,0))","v":"ja"},{"$f":"IF(R53=\"ja\",$A$1,0)","v":20},null,50,null,null,-53.994199999999999,37,51,40,-3]
[{"$f":"IF(ISERROR(RANK(B54,$B$4:$B$203,0)),\"\",RANK(B54,$B$4:$B$203,0))","v":51},{"$f":"IF(COUNT(F54:I54)=1,SUM(F54:I54)-50,IF(COUNT(F54:I54)=2,SUM(F54:I54)-100,IF(COUNT(F54:I54)=3,SUM(F54:I54)-150,IF(COUNT(F54:I54)=4,SUM(F54:I54)-200,\"\"))))","v":-55},{"$f":"IF(D54=\"\",\"\",L54)","v":9},"Köllner Johann",{"$f":"IF(ISERROR(VLOOKUP(D54,Namen!A:B,2,0)),\"\",VLOOKUP(D54,Namen!A:B,2,0))","v":"Prottes"},69,21,66,-11,{"$f":"IF(D54=0,\"\",SUM(T54:W54))","v":50},{"$f":"IF(F54=0,\"\",MAX(F54:I54))","v":69},9,null,null,null,null,{"$f":"IF(ISERROR(VLOOKUP(D54,Namen!A:C,3,0)),\"Z\",VLOOKUP(D54,Namen!A:C,3,0))","v":"m"},{"$f":"IF(ISERROR(VLOOKUP(D54,Namen!A:D,4,0)),\"Z\",VLOOKUP(D54,Namen!A:D,4,0))","v":"ja"},{"$f":"IF(R54=\"ja\",$A$1,0)","v":20},null,null,null,50,-54.993099999999998,54,66,21,-11]
[{"$f":"IF(ISERROR(RANK(B55,$B$4:$B$203,0)),\"\",RANK(B55,$B$4:$B$203,0))","v":51},{"$f":"IF(COUNT(F55:I55)=1,SUM(F55:I55)-50,IF(COUNT(F55:I55)=2,SUM(F55:I55)-100,IF(COUNT(F55:I55)=3,SUM(F55:I55)-150,IF(COUNT(F55:I55)=4,SUM(F55:I55)-200,\"\"))))","v":-55},{"$f":"IF(D55=\"\",\"\",L55)","v":29},"Kovacs Franz",{"$f":"IF(ISERROR(VLOOKUP(D55,Namen!A:B,2,0)),\"\",VLOOKUP(D55,Namen!A:B,2,0))","v":"Groissenbrunn"},20,-9,68,66,{"$f":"IF(D55=0,\"\",SUM(T55:W55))","v":50},{"$f":"IF(F55=0,\"\",MAX(F55:I55))","v":68},29,null,null,null,null,{"$f":"IF(ISERROR(VLOOKUP(D55,Namen!A:C,3,0)),\"Z\",VLOOKUP(D55,Namen!A:C,3,0))","v":"m"},{"$f":"IF(ISERROR(VLOOKUP(D55,Namen!A:D,4,0)),\"Z\",VLOOKUP(D55,Namen!A:D,4,0))","v":"ja"},{"$f":"IF(R55=\"ja\",$A$1,0)","v":20},null,50,null,null,-54.993200000000002,55,66,20,-9]
[{"$f":"IF(ISERROR(RANK(B56,$B$4:$B$203,0)),\"\",RANK(B56,$B$4:$B$203,0))","v":53},{"$f":"IF(COUNT(F56:I56)=1,SUM(F56:I56)-50,IF(COUNT(F56:I56)=2,SUM(F56:I56)-100,IF(COUNT(F56:I56)=3,SUM(F56:I56)-150,IF(COUNT(F56:I56)=4,SUM(F56:I56)-200,\"\"))))","v":-64},{"$f":"IF(D56=\"\",\"\",L56)","v":28},"Wolf Sissi",{"$f":"IF(ISERROR(VLOOKUP(D56,Namen!A:B,2,0)),\"\",VLOOKUP(D56,Namen!A:B,2,0))","v":"Reyersdorf"},64,25,16,31,{"$f":"IF(D56=0,\"\",SUM(T56:W56))","v":0},{"$f":"IF(F56=0,\"\",MAX(F56:I56))","v":64},28,null,null,null,null,{"$f":"IF(ISERROR(VLOOKUP(D56,Namen!A:C,3,0)),\"Z\",VLOOKUP(D56,Namen!A:C,3,0))","v":"w"},{"$f":"IF(ISERROR(VLOOKUP(D56,Namen!A:D,4,0)),\"Z\",VLOOKUP(D56,Namen!A:D,4,0))","v":"ja"},{"$f":"IF(R56=\"ja\",$A$1,0)","v":20},null,null,null,null,-63.993600000000001,51,31,25,16]
[{"$f":"IF(ISERROR(RANK(B57,$B$4:$B$203,0)),\"\",RANK(B57,$B$4:$B$203,0))","v":54},{"$f":"IF(COUNT(F57:I57)=1,SUM(F57:I57)-50,IF(COUNT(F57:I57)=2,SUM(F57:I57)-100,IF(COUNT(F57:I57)=3,SUM(F57:I57)-150,IF(COUNT(F57:I57)=4,SUM(F57:I57)-200,\"\"))))","v":-69},{"$f":"IF(D57=\"\",\"\",L57)","v":49},"Böttner Kurt",{"$f":"IF(ISERROR(VLOOKUP(D57,Namen!A:B,2,0)),\"\",VLOOKUP(D57,Namen!A:B,2,0))","v":"Angern"},36,40,42,13,{"$f":"IF(D57=0,\"\",SUM(T57:W57))","v":0},{"$f":"IF(F57=0,\"\",MAX(F57:I57))","v":42},49,null,null,null,null,{"$f":"IF(ISERROR(VLOOKUP(D57,Namen!A:C,3,0)),\"Z\",VLOOKUP(D57,Namen!A:C,3,0))","v":""},{"$f":"IF(ISERROR(VLOOKUP(D57,Namen!A:D,4,0)),\"Z\",VLOOKUP(D57,Namen!A:D,4,0))","v":""},{"$f":"IF(R57=\"ja\",$A$1,0)","v":0},null,null,null,null,-68.995800000000003,43,40,36,13]
[{"$f":"IF(ISERROR(RANK(B58,$B$4:$B$203,0)),\"\",RANK(B58,$B$4:$B$203,0))","v":55},{"$f":"IF(COUNT(F58:I58)=1,SUM(F58:I58)-50,IF(COUNT(F58:I58)=2,SUM(F58:I58)-100,IF(COUNT(F58:I58)=3,SUM(F58:I58)-150,IF(COUNT(F58:I58)=4,SUM(F58:I58)-200,\"\"))))","v":-77},{"$f":"IF(D58=\"\",\"\",L58)","v":46},"Mokesch Friedrich",{"$f":"IF(ISERROR(VLOOKUP(D58,Namen!A:B,2,0)),\"\",VLOOKUP(D58,Namen!A:B,2,0))","v":"Hohenau"},30,71,0,22,{"$f":"IF(D58=0,\"\",SUM(T58:W58))","v":0},{"$f":"IF(F58=0,\"\",MAX(F58:I58))","v":71},46,null,null,null,null,{"$f":"IF(ISERROR(VLOOKUP(D58,Namen!A:C,3,0)),\"Z\",VLOOKUP(D58,Namen!A:C,3,0))","v":"m"},{"$f":"IF(ISERROR(VLOOKUP(D58,Namen!A:D,4,0)),\"Z\",VLOOKUP(D58,Namen!A:D,4,0))","v":"ja"},{"$f":"IF(R58=\"ja\",$A$1,0)","v":20},null,null,null,null,-76.992900000000006,53,30,22,0]
[{"$f":"IF(ISERROR(RANK(B59,$B$4:$B$203,0)),\"\",RANK(B59,$B$4:$B$203,0))","v":56},{"$f":"IF(COUNT(F59:I59)=1,SUM(F59:I59)-50,IF(COUNT(F59:I59)=2,SUM(F59:I59)-100,IF(COUNT(F59:I59)=3,SUM(F59:I59)-150,IF(COUNT(F59:I59)=4,SUM(F59:I59)-200,\"\"))))","v":-91},{"$f":"IF(D59=\"\",\"\",L59)","v":23},"Vogt Theo",{"$f":"IF(ISERROR(VLOOKUP(D59,Namen!A:B,2,0)),\"\",VLOOKUP(D59,Namen!A:B,2,0))","v":"Pillichsdorf"},16,40,-5,58,{"$f":"IF(D59=0,\"\",SUM(T59:W59))","v":50},{"$f":"IF(F59=0,\"\",MAX(F59:I59))","v":58},23,null,null,null,null,{"$f":"IF(ISERROR(VLOOKUP(D59,Namen!A:C,3,0)),\"Z\",VLOOKUP(D59,Namen!A:C,3,0))","v":"m"},{"$f":"IF(ISERROR(VLOOKUP(D59,Namen!A:D,4,0)),\"Z\",VLOOKUP(D59,Namen!A:D,4,0))","v":"ja"},{"$f":"IF(R59=\"ja\",$A$1,0)","v":20},null,null,50,null,-90.994200000000006,56,40,16,-5]
[{"$f":"IF(ISERROR(RANK(B60,$B$4:$B$203,0)),\"\",RANK(B60,$B$4:$B$203,0))","v":""},{"$f":"IF(COUNT(F60:I60)=1,SUM(F60:I60)-50,IF(COUNT(F60:I60)=2,SUM(F60:I60)-100,IF(COUNT(F60:I60)=3,SUM(F60:I60)-150,IF(COUNT(F60:I60)=4,SUM(F60:I60)-200,\"\"))))","v":""},{"$f":"IF(D60=\"\",\"\",L60)","v":""},null,{"$f":"IF(ISERROR(VLOOKUP(D60,Namen!A:B,2,0)),\"\",VLOOKUP(D60,Namen!A:B,2,0))","v":""},null,null,null,null,{"$f":"IF(D60=0,\"\",SUM(T60:W60))","v":""},{"$f":"IF(F60=0,\"\",MAX(F60:I60))","v":""},57,null,null,null,null,{"$f":"IF(ISERROR(VLOOKUP(D60,Namen!A:C,3,0)),\"Z\",VLOOKUP(D60,Namen!A:C,3,0))","v":"Z"},{"$f":"IF(ISERROR(VLOOKUP(D60,Namen!A:D,4,0)),\"Z\",VLOOKUP(D60,Namen!A:D,4,0))","v":"Z"},{"$f":"IF(R60=\"ja\",$A$1,0)","v":0},null,null,null,null,"","","","",""]
[{"$f":"IF(ISERROR(RANK(B61,$B$4:$B$203,0)),\"\",RANK(B61,$B$4:$B$203,0))","v":""},{"$f":"IF(COUNT(F61:I61)=1,SUM(F61:I61)-50,IF(COUNT(F61:I61)=2,SUM(F61:I61)-100,IF(COUNT(F61:I61)=3,SUM(F61:I61)-150,IF(COUNT(F61:I61)=4,SUM(F61:I61)-200,\"\"))))","v":""},{"$f":"IF(D61=\"\",\"\",L61)","v":""},null,{"$f":"IF(ISERROR(VLOOKUP(D61,Namen!A:B,2,0)),\"\",VLOOKUP(D61,Namen!A:B,2,0))","v":""},null,null,null,null,{"$f":"IF(D61=0,\"\",SUM(T61:W61))","v":""},{"$f":"IF(F61=0,\"\",MAX(F61:I61))","v":""},58,null,null,null,null,{"$f":"IF(ISERROR(VLOOKUP(D61,Namen!A:C,3,0)),\"Z\",VLOOKUP(D61,Namen!A:C,3,0))","v":"Z"},{"$f":"IF(ISERROR(VLOOKUP(D61,Namen!A:D,4,0)),\"Z\",VLOOKUP(D61,Namen!A:D,4,0))","v":"Z"},{"$f":"IF(R61=\"ja\",$A$1,0)","v":0},null,null,null,null,"","","","",""]
[{"$f":"IF(ISERROR(RANK(B62,$B$4:$B$203,0)),\"\",RANK(B62,$B$4:$B$203,0))","v":""},{"$f":"IF(COUNT(F62:I62)=1,SUM(F62:I62)-50,IF(COUNT(F62:I62)=2,SUM(F62:I62)-100,IF(COUNT(F62:I62)=3,SUM(F62:I62)-150,IF(COUNT(F62:I62)=4,SUM(F62:I62)-200,\"\"))))","v":""},{"$f":"IF(D62=\"\",\"\",L62)","v":""},null,{"$f":"IF(ISERROR(VLOOKUP(D62,Namen!A:B,2,0)),\"\",VLOOKUP(D62,Namen!A:B,2,0))","v":""},null,null,null,null,{"$f":"IF(D62=0,\"\",SUM(T62:W62))","v":""},{"$f":"IF(F62=0,\"\",MAX(F62:I62))","v":""},59,null,null,null,null,{"$f":"IF(ISERROR(VLOOKUP(D62,Namen!A:C,3,0)),\"Z\",VLOOKUP(D62,Namen!A:C,3,0))","v":"Z"},{"$f":"IF(ISERROR(VLOOKUP(D62,Namen!A:D,4,0)),\"Z\",VLOOKUP(D62,Namen!A:D,4,0))","v":"Z"},{"$f":"IF(R62=\"ja\",$A$1,0)","v":0},null,null,null,null,"","","","",""]
[{"$f":"IF(ISERROR(RANK(B63,$B$4:$B$203,0)),\"\",RANK(B63,$B$4:$B$203,0))","v":""},{"$f":"IF(COUNT(F63:I63)=1,SUM(F63:I63)-50,IF(COUNT(F63:I63)=2,SUM(F63:I63)-100,IF(COUNT(F63:I63)=3,SUM(F63:I63)-150,IF(COUNT(F63:I63)=4,SUM(F63:I63)-200,\"\"))))","v":""},{"$f":"IF(D63=\"\",\"\",L63)","v":""},null,{"$f":"IF(ISERROR(VLOOKUP(D63,Namen!A:B,2,0)),\"\",VLOOKUP(D63,Namen!A:B,2,0))","v":""},null,null,null,null,{"$f":"IF(D63=0,\"\",SUM(T63:W63))","v":""},{"$f":"IF(F63=0,\"\",MAX(F63:I63))","v":""},60,null,null,null,null,{"$f":"IF(ISERROR(VLOOKUP(D63,Namen!A:C,3,0)),\"Z\",VLOOKUP(D63,Namen!A:C,3,0))","v":"Z"},{"$f":"IF(ISERROR(VLOOKUP(D63,Namen!A:D,4,0)),\"Z\",VLOOKUP(D63,Namen!A:D,4,0))","v":"Z"},{"$f":"IF(R63=\"ja\",$A$1,0)","v":0},null,null,null,null,"","","","",""]
[{"$f":"IF(ISERROR(RANK(B64,$B$4:$B$203,0)),\"\",RANK(B64,$B$4:$B$203,0))","v":""},{"$f":"IF(COUNT(F64:I64)=1,SUM(F64:I64)-50,IF(COUNT(F64:I64)=2,SUM(F64:I64)-100,IF(COUNT(F64:I64)=3,SUM(F64:I64)-150,IF(COUNT(F64:I64)=4,SUM(F64:I64)-200,\"\"))))","v":""},{"$f":"IF(D64=\"\",\"\",L64)","v":""},null,{"$f":"IF(ISERROR(VLOOKUP(D64,Namen!A:B,2,0)),\"\",VLOOKUP(D64,Namen!A:B,2,0))","v":""},null,null,null,null,{"$f":"IF(D64=0,\"\",SUM(T64:W64))","v":""},{"$f":"IF(F64=0,\"\",MAX(F64:I64))","v":""},61,null,null,null,null,{"$f":"IF(ISERROR(VLOOKUP(D64,Namen!A:C,3,0)),\"Z\",VLOOKUP(D64,Namen!A:C,3,0))","v":"Z"},{"$f":"IF(ISERROR(VLOOKUP(D64,Namen!A:D,4,0)),\"Z\",VLOOKUP(D64,Namen!A:D,4,0))","v":"Z"},{"$f":"IF(R64=\"ja\",$A$1,0)","v":0},null,null,null,null,"","","","",""]
[{"$f":"IF(ISERROR(RANK(B65,$B$4:$B$203,0)),\"\",RANK(B65,$B$4:$B$203,0))","v":""},{"$f":"IF(COUNT(F65:I65)=1,SUM(F65:I65)-50,IF(COUNT(F65:I65)=2,SUM(F65:I65)-100,IF(COUNT(F65:I65)=3,SUM(F65:I65)-150,IF(COUNT(F65:I65)=4,SUM(F65:I65)-200,\"\"))))","v":""},{"$f":"IF(D65=\"\",\"\",L65)","v":""},null,{"$f":"IF(ISERROR(VLOOKUP(D65,Namen!A:B,2,0)),\"\",VLOOKUP(D65,Namen!A:B,2,0))","v":""},null,null,null,null,{"$f":"IF(D65=0,\"\",SUM(T65:W65))","v":""},{"$f":"IF(F65=0,\"\",MAX(F65:I65))","v":""},62,null,null,null,null,{"$f":"IF(ISERROR(VLOOKUP(D65,Namen!A:C,3,0)),\"Z\",VLOOKUP(D65,Namen!A:C,3,0))","v":"Z"},{"$f":"IF(ISERROR(VLOOKUP(D65,Namen!A:D,4,0)),\"Z\",VLOOKUP(D65,Namen!A:D,4,0))","v":"Z"},{"$f":"IF(R65=\"ja\",$A$1,0)","v":0},null,null,null,null,"","","","",""]
[{"$f":"IF(ISERROR(RANK(B66,$B$4:$B$203,0)),\"\",RANK(B66,$B$4:$B$203,0))","v":""},{"$f":"IF(COUNT(F66:I66)=1,SUM(F66:I66)-50,IF(COUNT(F66:I66)=2,SUM(F66:I66)-100,IF(COUNT(F66:I66)=3,SUM(F66:I66)-150,IF(COUNT(F66:I66)=4,SUM(F66:I66)-200,\"\"))))","v":""},{"$f":"IF(D66=\"\",\"\",L66)","v":""},null,{"$f":"IF(ISERROR(VLOOKUP(D66,Namen!A:B,2,0)),\"\",VLOOKUP(D66,Namen!A:B,2,0))","v":""},null,null,null,null,{"$f":"IF(D66=0,\"\",SUM(T66:W66))","v":""},{"$f":"IF(F66=0,\"\",MAX(F66:I66))","v":""},63,null,null,null,null,{"$f":"IF(ISERROR(VLOOKUP(D66,Namen!A:C,3,0)),\"Z\",VLOOKUP(D66,Namen!A:C,3,0))","v":"Z"},{"$f":"IF(ISERROR(VLOOKUP(D66,Namen!A:D,4,0)),\"Z\",VLOOKUP(D66,Namen!A:D,4,0))","v":"Z"},{"$f":"IF(R66=\"ja\",$A$1,0)","v":0},null,null,null,null,"","","","",""]
[{"$f":"IF(ISERROR(RANK(B67,$B$4:$B$203,0)),\"\",RANK(B67,$B$4:$B$203,0))","v":""},{"$f":"IF(COUNT(F67:I67)=1,SUM(F67:I67)-50,IF(COUNT(F67:I67)=2,SUM(F67:I67)-100,IF(COUNT(F67:I67)=3,SUM(F67:I67)-150,IF(COUNT(F67:I67)=4,SUM(F67:I67)-200,\"\"))))","v":""},{"$f":"IF(D67=\"\",\"\",L67)","v":""},null,{"$f":"IF(ISERROR(VLOOKUP(D67,Namen!A:B,2,0)),\"\",VLOOKUP(D67,Namen!A:B,2,0))","v":""},null,null,null,null,{"$f":"IF(D67=0,\"\",SUM(T67:W67))","v":""},{"$f":"IF(F67=0,\"\",MAX(F67:I67))","v":""},64,null,null,null,null,{"$f":"IF(ISERROR(VLOOKUP(D67,Namen!A:C,3,0)),\"Z\",VLOOKUP(D67,Namen!A:C,3,0))","v":"Z"},{"$f":"IF(ISERROR(VLOOKUP(D67,Namen!A:D,4,0)),\"Z\",VLOOKUP(D67,Namen!A:D,4,0))","v":"Z"},{"$f":"IF(R67=\"ja\",$A$1,0)","v":0},null,null,null,null,"","","","",""]
[{"$f":"IF(ISERROR(RANK(B68,$B$4:$B$203,0)),\"\",RANK(B68,$B$4:$B$203,0))","v":""},{"$f":"IF(COUNT(F68:I68)=1,SUM(F68:I68)-50,IF(COUNT(F68:I68)=2,SUM(F68:I68)-100,IF(COUNT(F68:I68)=3,SUM(F68:I68)-150,IF(COUNT(F68:I68)=4,SUM(F68:I68)-200,\"\"))))","v":""},{"$f":"IF(D68=\"\",\"\",L68)","v":""},null,{"$f":"IF(ISERROR(VLOOKUP(D68,Namen!A:B,2,0)),\"\",VLOOKUP(D68,Namen!A:B,2,0))","v":""},null,null,null,null,{"$f":"IF(D68=0,\"\",SUM(T68:W68))","v":""},{"$f":"IF(F68=0,\"\",MAX(F68:I68))","v":""},65,null,null,null,null,{"$f":"IF(ISERROR(VLOOKUP(D68,Namen!A:C,3,0)),\"Z\",VLOOKUP(D68,Namen!A:C,3,0))","v":"Z"},{"$f":"IF(ISERROR(VLOOKUP(D68,Namen!A:D,4,0)),\"Z\",VLOOKUP(D68,Namen!A:D,4,0))","v":"Z"},{"$f":"IF(R68=\"ja\",$A$1,0)","v":0},null,null,null,null,"","","","",""]
[{"$f":"IF(ISERROR(RANK(B69,$B$4:$B$203,0)),\"\",RANK(B69,$B$4:$B$203,0))","v":""},{"$f":"IF(COUNT(F69:I69)=1,SUM(F69:I69)-50,IF(COUNT(F69:I69)=2,SUM(F69:I69)-100,IF(COUNT(F69:I69)=3,SUM(F69:I69)-150,IF(COUNT(F69:I69)=4,SUM(F69:I69)-200,\"\"))))","v":""},{"$f":"IF(D69=\"\",\"\",L69)","v":""},null,{"$f":"IF(ISERROR(VLOOKUP(D69,Namen!A:B,2,0)),\"\",VLOOKUP(D69,Namen!A:B,2,0))","v":""},null,null,null,null,{"$f":"IF(D69=0,\"\",SUM(T69:W69))","v":""},{"$f":"IF(F69=0,\"\",MAX(F69:I69))","v":""},66,null,null,null,null,{"$f":"IF(ISERROR(VLOOKUP(D69,Namen!A:C,3,0)),\"Z\",VLOOKUP(D69,Namen!A:C,3,0))","v":"Z"},{"$f":"IF(ISERROR(VLOOKUP(D69,Namen!A:D,4,0)),\"Z\",VLOOKUP(D69,Namen!A:D,4,0))","v":"Z"},{"$f":"IF(R69=\"ja\",$A$1,0)","v":0},null,null,null,null,"",{"$f":"IF(ISERROR(RANK(AA69,$AA$4:$AA$203,0)),\"\",RANK(AA69,$AA$4:$AA$203,0))","v":""},{"$f":"IFERROR(LARGE(F69:I69,2),\"\")","v":""},{"$f":"IFERROR(LARGE(F69:I69,3),\"\")","v":""},{"$f":"IFERROR(LARGE(F69:I69,4),\"\")","v":""}]
[{"$f":"IF(ISERROR(RANK(B70,$B$4:$B$203,0)),\"\",RANK(B70,$B$4:$B$203,0))","v":""},{"$f":"IF(COUNT(F70:I70)=1,SUM(F70:I70)-50,IF(COUNT(F70:I70)=2,SUM(F70:I70)-100,IF(COUNT(F70:I70)=3,SUM(F70:I70)-150,IF(COUNT(F70:I70)=4,SUM(F70:I70)-200,\"\"))))","v":""},{"$f":"IF(D70=\"\",\"\",L70)","v":""},null,{"$f":"IF(ISERROR(VLOOKUP(D70,Namen!A:B,2,0)),\"\",VLOOKUP(D70,Namen!A:B,2,0))","v":""},null,null,null,null,{"$f":"IF(D70=0,\"\",SUM(T70:W70))","v":""},{"$f":"IF(F70=0,\"\",MAX(F70:I70))","v":""},67,null,null,null,null,{"$f":"IF(ISERROR(VLOOKUP(D70,Namen!A:C,3,0)),\"Z\",VLOOKUP(D70,Namen!A:C,3,0))","v":"Z"},{"$f":"IF(ISERROR(VLOOKUP(D70,Namen!A:D,4,0)),\"Z\",VLOOKUP(D70,Namen!A:D,4,0))","v":"Z"},{"$f":"IF(R70=\"ja\",$A$1,0)","v":0},null,null,null,null,"","","","",""]
[{"$f":"IF(ISERROR(RANK(B71,$B$4:$B$203,0)),\"\",RANK(B71,$B$4:$B$203,0))","v":""},{"$f":"IF(COUNT(F71:I71)=1,SUM(F71:I71)-50,IF(COUNT(F71:I71)=2,SUM(F71:I71)-100,IF(COUNT(F71:I71)=3,SUM(F71:I71)-150,IF(COUNT(F71:I71)=4,SUM(F71:I71)-200,\"\"))))","v":""},{"$f":"IF(D71=\"\",\"\",L71)","v":""},null,{"$f":"IF(ISERROR(VLOOKUP(D71,Namen!A:B,2,0)),\"\",VLOOKUP(D71,Namen!A:B,2,0))","v":""},null,null,null,null,{"$f":"IF(D71=0,\"\",SUM(T71:W71))","v":""},{"$f":"IF(F71=0,\"\",MAX(F71:I71))","v":""},68,null,null,null,null,{"$f":"IF(ISERROR(VLOOKUP(D71,Namen!A:C,3,0)),\"Z\",VLOOKUP(D71,Namen!A:C,3,0))","v":"Z"},{"$f":"IF(ISERROR(VLOOKUP(D71,Namen!A:D,4,0)),\"Z\",VLOOKUP(D71,Namen!A:D,4,0))","v":"Z"},{"$f":"IF(R71=\"ja\",$A$1,0)","v":0},null,null,null,null,"","","","",""]
[{"$f":"IF(ISERROR(RANK(B72,$B$4:$B$203,0)),\"\",RANK(B72,$B$4:$B$203,0))","v":""},{"$f":"IF(COUNT(F72:I72)=1,SUM(F72:I72)-50,IF(COUNT(F72:I72)=2,SUM(F72:I72)-100,IF(COUNT(F72:I72)=3,SUM(F72:I72)-150,IF(COUNT(F72:I72)=4,SUM(F72:I72)-200,\"\"))))","v":""},{"$f":"IF(D72=\"\",\"\",L72)","v":""},null,{"$f":"IF(ISERROR(VLOOKUP(D72,Namen!A:B,2,0)),\"\",VLOOKUP(D72,Namen!A:B,2,0))","v":""},null,null,null,null,{"$f":"IF(D72=0,\"\",SUM(T72:W72))","v":""},{"$f":"IF(F72=0,\"\",MAX(F72:I72))","v":""},69,null,null,null,null,{"$f":"IF(ISERROR(VLOOKUP(D72,Namen!A:C,3,0)),\"Z\",VLOOKUP(D72,Namen!A:C,3,0))","v":"Z"},{"$f":"IF(ISERROR(VLOOKUP(D72,Namen!A:D,4,0)),\"Z\",VLOOKUP(D72,Namen!A:D,4,0))","v":"Z"},{"$f":"IF(R72=\"ja\",$A$1,0)","v":0},null,null,null,null,"","","","",""]
[{"$f":"IF(ISERROR(RANK(B73,$B$4:$B$203,0)),\"\",RANK(B73,$B$4:$B$203,0))","v":""},{"$f":"IF(COUNT(F73:I73)=1,SUM(F73:I73)-50,IF(COUNT(F73:I73)=2,SUM(F73:I73)-100,IF(COUNT(F73:I73)=3,SUM(F73:I73)-150,IF(COUNT(F73:I73)=4,SUM(F73:I73)-200,\"\"))))","v":""},{"$f":"IF(D73=\"\",\"\",L73)","v":""},null,{"$f":"IF(ISERROR(VLOOKUP(D73,Namen!A:B,2,0)),\"\",VLOOKUP(D73,Namen!A:B,2,0))","v":""},null,null,null,null,{"$f":"IF(D73=0,\"\",SUM(T73:W73))","v":""},{"$f":"IF(F73=0,\"\",MAX(F73:I73))","v":""},70,null,null,null,null,{"$f":"IF(ISERROR(VLOOKUP(D73,Namen!A:C,3,0)),\"Z\",VLOOKUP(D73,Namen!A:C,3,0))","v":"Z"},{"$f":"IF(ISERROR(VLOOKUP(D73,Namen!A:D,4,0)),\"Z\",VLOOKUP(D73,Namen!A:D,4,0))","v":"Z"},{"$f":"IF(R73=\"ja\",$A$1,0)","v":0},null,null,null,null,"","","","",""]
[{"$f":"IF(ISERROR(RANK(B74,$B$4:$B$203,0)),\"\",RANK(B74,$B$4:$B$203,0))","v":""},{"$f":"IF(COUNT(F74:I74)=1,SUM(F74:I74)-50,IF(COUNT(F74:I74)=2,SUM(F74:I74)-100,IF(COUNT(F74:I74)=3,SUM(F74:I74)-150,IF(COUNT(F74:I74)=4,SUM(F74:I74)-200,\"\"))))","v":""},{"$f":"IF(D74=\"\",\"\",L74)","v":""},null,{"$f":"IF(ISERROR(VLOOKUP(D74,Namen!A:B,2,0)),\"\",VLOOKUP(D74,Namen!A:B,2,0))","v":""},null,null,null,null,{"$f":"IF(D74=0,\"\",SUM(T74:W74))","v":""},{"$f":"IF(F74=0,\"\",MAX(F74:I74))","v":""},71,null,null,null,null,{"$f":"IF(ISERROR(VLOOKUP(D74,Namen!A:C,3,0)),\"Z\",VLOOKUP(D74,Namen!A:C,3,0))","v":"Z"},{"$f":"IF(ISERROR(VLOOKUP(D74,Namen!A:D,4,0)),\"Z\",VLOOKUP(D74,Namen!A:D,4,0))","v":"Z"},{"$f":"IF(R74=\"ja\",$A$1,0)","v":0},null,null,null,null,"","","","",""]
[{"$f":"IF(ISERROR(RANK(B75,$B$4:$B$203,0)),\"\",RANK(B75,$B$4:$B$203,0))","v":""},{"$f":"IF(COUNT(F75:I75)=1,SUM(F75:I75)-50,IF(COUNT(F75:I75)=2,SUM(F75:I75)-100,IF(COUNT(F75:I75)=3,SUM(F75:I75)-150,IF(COUNT(F75:I75)=4,SUM(F75:I75)-200,\"\"))))","v":""},{"$f":"IF(D75=\"\",\"\",L75)","v":""},null,{"$f":"IF(ISERROR(VLOOKUP(D75,Namen!A:B,2,0)),\"\",VLOOKUP(D75,Namen!A:B,2,0))","v":""},null,null,null,null,{"$f":"IF(D75=0,\"\",SUM(T75:W75))","v":""},{"$f":"IF(F75=0,\"\",MAX(F75:I75))","v":""},72,null,null,null,null,{"$f":"IF(ISERROR(VLOOKUP(D75,Namen!A:C,3,0)),\"Z\",VLOOKUP(D75,Namen!A:C,3,0))","v":"Z"},{"$f":"IF(ISERROR(VLOOKUP(D75,Namen!A:D,4,0)),\"Z\",VLOOKUP(D75,Namen!A:D,4,0))","v":"Z"},{"$f":"IF(R75=\"ja\",$A$1,0)","v":0},null,null,null,null,"","","","",""]
[{"$f":"IF(ISERROR(RANK(B76,$B$4:$B$203,0)),\"\",RANK(B76,$B$4:$B$203,0))","v":""},{"$f":"IF(COUNT(F76:I76)=1,SUM(F76:I76)-50,IF(COUNT(F76:I76)=2,SUM(F76:I76)-100,IF(COUNT(F76:I76)=3,SUM(F76:I76)-150,IF(COUNT(F76:I76)=4,SUM(F76:I76)-200,\"\"))))","v":""},{"$f":"IF(D76=\"\",\"\",L76)","v":""},null,{"$f":"IF(ISERROR(VLOOKUP(D76,Namen!A:B,2,0)),\"\",VLOOKUP(D76,Namen!A:B,2,0))","v":""},null,null,null,null,{"$f":"IF(D76=0,\"\",SUM(T76:W76))","v":""},{"$f":"IF(F76=0,\"\",MAX(F76:I76))","v":""},73,null,null,null,null,{"$f":"IF(ISERROR(VLOOKUP(D76,Namen!A:C,3,0)),\"Z\",VLOOKUP(D76,Namen!A:C,3,0))","v":"Z"},{"$f":"IF(ISERROR(VLOOKUP(D76,Namen!A:D,4,0)),\"Z\",VLOOKUP(D76,Namen!A:D,4,0))","v":"Z"},{"$f":"IF(R76=\"ja\",$A$1,0)","v":0},null,null,null,null,"","","","",""]
[{"$f":"IF(ISERROR(RANK(B77,$B$4:$B$203,0)),\"\",RANK(B77,$B$4:$B$203,0))","v":""},{"$f":"IF(COUNT(F77:I77)=1,SUM(F77:I77)-50,IF(COUNT(F77:I77)=2,SUM(F77:I77)-100,IF(COUNT(F77:I77)=3,SUM(F77:I77)-150,IF(COUNT(F77:I77)=4,SUM(F77:I77)-200,\"\"))))","v":""},{"$f":"IF(D77=\"\",\"\",L77)","v":""},null,{"$f":"IF(ISERROR(VLOOKUP(D77,Namen!A:B,2,0)),\"\",VLOOKUP(D77,Namen!A:B,2,0))","v":""},null,null,null,null,{"$f":"IF(D77=0,\"\",SUM(T77:W77))","v":""},{"$f":"IF(F77=0,\"\",MAX(F77:I77))","v":""},74,null,null,null,null,{"$f":"IF(ISERROR(VLOOKUP(D77,Namen!A:C,3,0)),\"Z\",VLOOKUP(D77,Namen!A:C,3,0))","v":"Z"},{"$f":"IF(ISERROR(VLOOKUP(D77,Namen!A:D,4,0)),\"Z\",VLOOKUP(D77,Namen!A:D,4,0))","v":"Z"},{"$f":"IF(R77=\"ja\",$A$1,0)","v":0},null,null,null,null,"","","","",""]
[{"$f":"IF(ISERROR(RANK(B78,$B$4:$B$203,0)),\"\",RANK(B78,$B$4:$B$203,0))","v":""},{"$f":"IF(COUNT(F78:I78)=1,SUM(F78:I78)-50,IF(COUNT(F78:I78)=2,SUM(F78:I78)-100,IF(COUNT(F78:I78)=3,SUM(F78:I78)-150,IF(COUNT(F78:I78)=4,SUM(F78:I78)-200,\"\"))))","v":""},{"$f":"IF(D78=\"\",\"\",L78)","v":""},null,{"$f":"IF(ISERROR(VLOOKUP(D78,Namen!A:B,2,0)),\"\",VLOOKUP(D78,Namen!A:B,2,0))","v":""},null,null,null,null,{"$f":"IF(D78=0,\"\",SUM(T78:W78))","v":""},{"$f":"IF(F78=0,\"\",MAX(F78:I78))","v":""},75,null,null,null,null,{"$f":"IF(ISERROR(VLOOKUP(D78,Namen!A:C,3,0)),\"Z\",VLOOKUP(D78,Namen!A:C,3,0))","v":"Z"},{"$f":"IF(ISERROR(VLOOKUP(D78,Namen!A:D,4,0)),\"Z\",VLOOKUP(D78,Namen!A:D,4,0))","v":"Z"},{"$f":"IF(R78=\"ja\",$A$1,0)","v":0},null,null,null,null,"","","","",""]
[{"$f":"IF(ISERROR(RANK(B79,$B$4:$B$203,0)),\"\",RANK(B79,$B$4:$B$203,0))","v":""},{"$f":"IF(COUNT(F79:I79)=1,SUM(F79:I79)-50,IF(COUNT(F79:I79)=2,SUM(F79:I79)-100,IF(COUNT(F79:I79)=3,SUM(F79:I79)-150,IF(COUNT(F79:I79)=4,SUM(F79:I79)-200,\"\"))))","v":""},{"$f":"IF(D79=\"\",\"\",L79)","v":""},null,{"$f":"IF(ISERROR(VLOOKUP(D79,Namen!A:B,2,0)),\"\",VLOOKUP(D79,Namen!A:B,2,0))","v":""},null,null,null,null,{"$f":"IF(D79=0,\"\",SUM(T79:W79))","v":""},{"$f":"IF(F79=0,\"\",MAX(F79:I79))","v":""},76,null,null,null,null,{"$f":"IF(ISERROR(VLOOKUP(D79,Namen!A:C,3,0)),\"Z\",VLOOKUP(D79,Namen!A:C,3,0))","v":"Z"},{"$f":"IF(ISERROR(VLOOKUP(D79,Namen!A:D,4,0)),\"Z\",VLOOKUP(D79,Namen!A:D,4,0))","v":"Z"},{"$f":"IF(R79=\"ja\",$A$1,0)","v":0},null,null,null,null,"","","","",""]
[{"$f":"IF(ISERROR(RANK(B80,$B$4:$B$203,0)),\"\",RANK(B80,$B$4:$B$203,0))","v":""},{"$f":"IF(COUNT(F80:I80)=1,SUM(F80:I80)-50,IF(COUNT(F80:I80)=2,SUM(F80:I80)-100,IF(COUNT(F80:I80)=3,SUM(F80:I80)-150,IF(COUNT(F80:I80)=4,SUM(F80:I80)-200,\"\"))))","v":""},{"$f":"IF(D80=\"\",\"\",L80)","v":""},null,{"$f":"IF(ISERROR(VLOOKUP(D80,Namen!A:B,2,0)),\"\",VLOOKUP(D80,Namen!A:B,2,0))","v":""},null,null,null,null,{"$f":"IF(D80=0,\"\",SUM(T80:W80))","v":""},{"$f":"IF(F80=0,\"\",MAX(F80:I80))","v":""},77,null,null,null,null,{"$f":"IF(ISERROR(VLOOKUP(D80,Namen!A:C,3,0)),\"Z\",VLOOKUP(D80,Namen!A:C,3,0))","v":"Z"},{"$f":"IF(ISERROR(VLOOKUP(D80,Namen!A:D,4,0)),\"Z\",VLOOKUP(D80,Namen!A:D,4,0))","v":"Z"},{"$f":"IF(R80=\"ja\",$A$1,0)","v":0},null,null,null,null,"","","","",""]
[{"$f":"IF(ISERROR(RANK(B81,$B$4:$B$203,0)),\"\",RANK(B81,$B$4:$B$203,0))","v":""},{"$f":"IF(COUNT(F81:I81)=1,SUM(F81:I81)-50,IF(COUNT(F81:I81)=2,SUM(F81:I81)-100,IF(COUNT(F81:I81)=3,SUM(F81:I81)-150,IF(COUNT(F81:I81)=4,SUM(F81:I81)-200,\"\"))))","v":""},{"$f":"IF(D81=\"\",\"\",L81)","v":""},null,{"$f":"IF(ISERROR(VLOOKUP(D81,Namen!A:B,2,0)),\"\",VLOOKUP(D81,Namen!A:B,2,0))","v":""},null,null,null,null,{"$f":"IF(D81=0,\"\",SUM(T81:W81))","v":""},{"$f":"IF(F81=0,\"\",MAX(F81:I81))","v":""},78,null,null,null,null,{"$f":"IF(ISERROR(VLOOKUP(D81,Namen!A:C,3,0)),\"Z\",VLOOKUP(D81,Namen!A:C,3,0))","v":"Z"},{"$f":"IF(ISERROR(VLOOKUP(D81,Namen!A:D,4,0)),\"Z\",VLOOKUP(D81,Namen!A:D,4,0))","v":"Z"},{"$f":"IF(R81=\"ja\",$A$1,0)","v":0},null,null,null,null,"","","","",""]
[{"$f":"IF(ISERROR(RANK(B82,$B$4:$B$203,0)),\"\",RANK(B82,$B$4:$B$203,0))","v":""},{"$f":"IF(COUNT(F82:I82)=1,SUM(F82:I82)-50,IF(COUNT(F82:I82)=2,SUM(F82:I82)-100,IF(COUNT(F82:I82)=3,SUM(F82:I82)-150,IF(COUNT(F82:I82)=4,SUM(F82:I82)-200,\"\"))))","v":""},{"$f":"IF(D82=\"\",\"\",L82)","v":""},null,{"$f":"IF(ISERROR(VLOOKUP(D82,Namen!A:B,2,0)),\"\",VLOOKUP(D82,Namen!A:B,2,0))","v":""},null,null,null,null,{"$f":"IF(D82=0,\"\",SUM(T82:W82))","v":""},{"$f":"IF(F82=0,\"\",MAX(F82:I82))","v":""},79,null,null,null,null,{"$f":"IF(ISERROR(VLOOKUP(D82,Namen!A:C,3,0)),\"Z\",VLOOKUP(D82,Namen!A:C,3,0))","v":"Z"},{"$f":"IF(ISERROR(VLOOKUP(D82,Namen!A:D,4,0)),\"Z\",VLOOKUP(D82,Namen!A:D,4,0))","v":"Z"},{"$f":"IF(R82=\"ja\",$A$1,0)","v":0},null,null,null,null,"","","","",""]
[{"$f":"IF(ISERROR(RANK(B83,$B$4:$B$203,0)),\"\",RANK(B83,$B$4:$B$203,0))","v":""},{"$f":"IF(COUNT(F83:I83)=1,SUM(F83:I83)-50,IF(COUNT(F83:I83)=2,SUM(F83:I83)-100,IF(COUNT(F83:I83)=3,SUM(F83:I83)-150,IF(COUNT(F83:I83)=4,SUM(F83:I83)-200,\"\"))))","v":""},{"$f":"IF(D83=\"\",\"\",L83)","v":""},null,{"$f":"IF(ISERROR(VLOOKUP(D83,Namen!A:B,2,0)),\"\",VLOOKUP(D83,Namen!A:B,2,0))","v":""},null,null,null,null,{"$f":"IF(D83=0,\"\",SUM(T83:W83))","v":""},{"$f":"IF(F83=0,\"\",MAX(F83:I83))","v":""},80,null,null,null,null,{"$f":"IF(ISERROR(VLOOKUP(D83,Namen!A:C,3,0)),\"Z\",VLOOKUP(D83,Namen!A:C,3,0))","v":"Z"},{"$f":"IF(ISERROR(VLOOKUP(D83,Namen!A:D,4,0)),\"Z\",VLOOKUP(D83,Namen!A:D,4,0))","v":"Z"},{"$f":"IF(R83=\"ja\",$A$1,0)","v":0},null,null,null,null,"","","","",""]
[{"$f":"IF(ISERROR(RANK(B84,$B$4:$B$203,0)),\"\",RANK(B84,$B$4:$B$203,0))","v":""},{"$f":"IF(COUNT(F84:I84)=1,SUM(F84:I84)-50,IF(COUNT(F84:I84)=2,SUM(F84:I84)-100,IF(COUNT(F84:I84)=3,SUM(F84:I84)-150,IF(COUNT(F84:I84)=4,SUM(F84:I84)-200,\"\"))))","v":""},{"$f":"IF(D84=\"\",\"\",L84)","v":""},null,{"$f":"IF(ISERROR(VLOOKUP(D84,Namen!A:B,2,0)),\"\",VLOOKUP(D84,Namen!A:B,2,0))","v":""},null,null,null,null,{"$f":"IF(D84=0,\"\",SUM(T84:W84))","v":""},{"$f":"IF(F84=0,\"\",MAX(F84:I84))","v":""},81,null,null,null,null,{"$f":"IF(ISERROR(VLOOKUP(D84,Namen!A:C,3,0)),\"Z\",VLOOKUP(D84,Namen!A:C,3,0))","v":"Z"},{"$f":"IF(ISERROR(VLOOKUP(D84,Namen!A:D,4,0)),\"Z\",VLOOKUP(D84,Namen!A:D,4,0))","v":"Z"},{"$f":"IF(R84=\"ja\",$A$1,0)","v":0},null,null,null,null,"","","","",""]
[{"$f":"IF(ISERROR(RANK(B85,$B$4:$B$203,0)),\"\",RANK(B85,$B$4:$B$203,0))","v":""},{"$f":"IF(COUNT(F85:I85)=1,SUM(F85:I85)-50,IF(COUNT(F85:I85)=2,SUM(F85:I85)-100,IF(COUNT(F85:I85)=3,SUM(F85:I85)-150,IF(COUNT(F85:I85)=4,SUM(F85:I85)-200,\"\"))))","v":""},{"$f":"IF(D85=\"\",\"\",L85)","v":""},null,{"$f":"IF(ISERROR(VLOOKUP(D85,Namen!A:B,2,0)),\"\",VLOOKUP(D85,Namen!A:B,2,0))","v":""},null,null,null,null,{"$f":"IF(D85=0,\"\",SUM(T85:W85))","v":""},{"$f":"IF(F85=0,\"\",MAX(F85:I85))","v":""},82,null,null,null,null,{"$f":"IF(ISERROR(VLOOKUP(D85,Namen!A:C,3,0)),\"Z\",VLOOKUP(D85,Namen!A:C,3,0))","v":"Z"},{"$f":"IF(ISERROR(VLOOKUP(D85,Namen!A:D,4,0)),\"Z\",VLOOKUP(D85,Namen!A:D,4,0))","v":"Z"},{"$f":"IF(R85=\"ja\",$A$1,0)","v":0},null,null,null,null,"","","","",""]
[{"$f":"IF(ISERROR(RANK(B86,$B$4:$B$203,0)),\"\",RANK(B86,$B$4:$B$203,0))","v":""},{"$f":"IF(COUNT(F86:I86)=1,SUM(F86:I86)-50,IF(COUNT(F86:I86)=2,SUM(F86:I86)-100,IF(COUNT(F86:I86)=3,SUM(F86:I86)-150,IF(COUNT(F86:I86)=4,SUM(F86:I86)-200,\"\"))))","v":""},{"$f":"IF(D86=\"\",\"\",L86)","v":""},null,{"$f":"IF(ISERROR(VLOOKUP(D86,Namen!A:B,2,0)),\"\",VLOOKUP(D86,Namen!A:B,2,0))","v":""},null,null,null,null,{"$f":"IF(D86=0,\"\",SUM(T86:W86))","v":""},{"$f":"IF(F86=0,\"\",MAX(F86:I86))","v":""},83,null,null,null,null,{"$f":"IF(ISERROR(VLOOKUP(D86,Namen!A:C,3,0)),\"Z\",VLOOKUP(D86,Namen!A:C,3,0))","v":"Z"},{"$f":"IF(ISERROR(VLOOKUP(D86,Namen!A:D,4,0)),\"Z\",VLOOKUP(D86,Namen!A:D,4,0))","v":"Z"},{"$f":"IF(R86=\"ja\",$A$1,0)","v":0},null,null,null,null,"","","","",""]
[{"$f":"IF(ISERROR(RANK(B87,$B$4:$B$203,0)),\"\",RANK(B87,$B$4:$B$203,0))","v":""},{"$f":"IF(COUNT(F87:I87)=1,SUM(F87:I87)-50,IF(COUNT(F87:I87)=2,SUM(F87:I87)-100,IF(COUNT(F87:I87)=3,SUM(F87:I87)-150,IF(COUNT(F87:I87)=4,SUM(F87:I87)-200,\"\"))))","v":""},{"$f":"IF(D87=\"\",\"\",L87)","v":""},null,{"$f":"IF(ISERROR(VLOOKUP(D87,Namen!A:B,2,0)),\"\",VLOOKUP(D87,Namen!A:B,2,0))","v":""},null,null,null,null,{"$f":"IF(D87=0,\"\",SUM(T87:W87))","v":""},{"$f":"IF(F87=0,\"\",MAX(F87:I87))","v":""},84,null,null,null,null,{"$f":"IF(ISERROR(VLOOKUP(D87,Namen!A:C,3,0)),\"Z\",VLOOKUP(D87,Namen!A:C,3,0))","v":"Z"},{"$f":"IF(ISERROR(VLOOKUP(D87,Namen!A:D,4,0)),\"Z\",VLOOKUP(D87,Namen!A:D,4,0))","v":"Z"},{"$f":"IF(R87=\"ja\",$A$1,0)","v":0},null,null,null,null,"","","","",""]
[{"$f":"IF(ISERROR(RANK(B88,$B$4:$B$203,0)),\"\",RANK(B88,$B$4:$B$203,0))","v":""},{"$f":"IF(COUNT(F88:I88)=1,SUM(F88:I88)-50,IF(COUNT(F88:I88)=2,SUM(F88:I88)-100,IF(COUNT(F88:I88)=3,SUM(F88:I88)-150,IF(COUNT(F88:I88)=4,SUM(F88:I88)-200,\"\"))))","v":""},{"$f":"IF(D88=\"\",\"\",L88)","v":""},null,{"$f":"IF(ISERROR(VLOOKUP(D88,Namen!A:B,2,0)),\"\",VLOOKUP(D88,Namen!A:B,2,0))","v":""},null,null,null,null,{"$f":"IF(D88=0,\"\",SUM(T88:W88))","v":""},{"$f":"IF(F88=0,\"\",MAX(F88:I88))","v":""},85,null,null,null,null,{"$f":"IF(ISERROR(VLOOKUP(D88,Namen!A:C,3,0)),\"Z\",VLOOKUP(D88,Namen!A:C,3,0))","v":"Z"},{"$f":"IF(ISERROR(VLOOKUP(D88,Namen!A:D,4,0)),\"Z\",VLOOKUP(D88,Namen!A:D,4,0))","v":"Z"},{"$f":"IF(R88=\"ja\",$A$1,0)","v":0},null,null,null,null,"","","","",""]
[{"$f":"IF(ISERROR(RANK(B89,$B$4:$B$203,0)),\"\",RANK(B89,$B$4:$B$203,0))","v":""},{"$f":"IF(COUNT(F89:I89)=1,SUM(F89:I89)-50,IF(COUNT(F89:I89)=2,SUM(F89:I89)-100,IF(COUNT(F89:I89)=3,SUM(F89:I89)-150,IF(COUNT(F89:I89)=4,SUM(F89:I89)-200,\"\"))))","v":""},{"$f":"IF(D89=\"\",\"\",L89)","v":""},null,{"$f":"IF(ISERROR(VLOOKUP(D89,Namen!A:B,2,0)),\"\",VLOOKUP(D89,Namen!A:B,2,0))","v":""},null,null,null,null,{"$f":"IF(D89=0,\"\",SUM(T89:W89))","v":""},{"$f":"IF(F89=0,\"\",MAX(F89:I89))","v":""},86,null,null,null,null,{"$f":"IF(ISERROR(VLOOKUP(D89,Namen!A:C,3,0)),\"Z\",VLOOKUP(D89,Namen!A:C,3,0))","v":"Z"},{"$f":"IF(ISERROR(VLOOKUP(D89,Namen!A:D,4,0)),\"Z\",VLOOKUP(D89,Namen!A:D,4,0))","v":"Z"},{"$f":"IF(R89=\"ja\",$A$1,0)","v":0},null,null,null,null,"","","","",""]
[{"$f":"IF(ISERROR(RANK(B90,$B$4:$B$203,0)),\"\",RANK(B90,$B$4:$B$203,0))","v":""},{"$f":"IF(COUNT(F90:I90)=1,SUM(F90:I90)-50,IF(COUNT(F90:I90)=2,SUM(F90:I90)-100,IF(COUNT(F90:I90)=3,SUM(F90:I90)-150,IF(COUNT(F90:I90)=4,SUM(F90:I90)-200,\"\"))))","v":""},{"$f":"IF(D90=\"\",\"\",L90)","v":""},null,{"$f":"IF(ISERROR(VLOOKUP(D90,Namen!A:B,2,0)),\"\",VLOOKUP(D90,Namen!A:B,2,0))","v":""},null,null,null,null,{"$f":"IF(D90=0,\"\",SUM(T90:W90))","v":""},{"$f":"IF(F90=0,\"\",MAX(F90:I90))","v":""},87,null,null,null,null,{"$f":"IF(ISERROR(VLOOKUP(D90,Namen!A:C,3,0)),\"Z\",VLOOKUP(D90,Namen!A:C,3,0))","v":"Z"},{"$f":"IF(ISERROR(VLOOKUP(D90,Namen!A:D,4,0)),\"Z\",VLOOKUP(D90,Namen!A:D,4,0))","v":"Z"},{"$f":"IF(R90=\"ja\",$A$1,0)","v":0},null,null,null,null,"","","","",""]
[{"$f":"IF(ISERROR(RANK(B91,$B$4:$B$203,0)),\"\",RANK(B91,$B$4:$B$203,0))","v":""},{"$f":"IF(COUNT(F91:I91)=1,SUM(F91:I91)-50,IF(COUNT(F91:I91)=2,SUM(F91:I91)-100,IF(COUNT(F91:I91)=3,SUM(F91:I91)-150,IF(COUNT(F91:I91)=4,SUM(F91:I91)-200,\"\"))))","v":""},{"$f":"IF(D91=\"\",\"\",L91)","v":""},null,{"$f":"IF(ISERROR(VLOOKUP(D91,Namen!A:B,2,0)),\"\",VLOOKUP(D91,Namen!A:B,2,0))","v":""},null,null,null,null,{"$f":"IF(D91=0,\"\",SUM(T91:W91))","v":""},{"$f":"IF(F91=0,\"\",MAX(F91:I91))","v":""},88,null,null,null,null,{"$f":"IF(ISERROR(VLOOKUP(D91,Namen!A:C,3,0)),\"Z\",VLOOKUP(D91,Namen!A:C,3,0))","v":"Z"},{"$f":"IF(ISERROR(VLOOKUP(D91,Namen!A:D,4,0)),\"Z\",VLOOKUP(D91,Namen!A:D,4,0))","v":"Z"},{"$f":"IF(R91=\"ja\",$A$1,0)","v":0},null,null,null,null,"","","","",""]
[{"$f":"IF(ISERROR(RANK(B92,$B$4:$B$203,0)),\"\",RANK(B92,$B$4:$B$203,0))","v":""},{"$f":"IF(COUNT(F92:I92)=1,SUM(F92:I92)-50,IF(COUNT(F92:I92)=2,SUM(F92:I92)-100,IF(COUNT(F92:I92)=3,SUM(F92:I92)-150,IF(COUNT(F92:I92)=4,SUM(F92:I92)-200,\"\"))))","v":""},{"$f":"IF(D92=\"\",\"\",L92)","v":""},null,{"$f":"IF(ISERROR(VLOOKUP(D92,Namen!A:B,2,0)),\"\",VLOOKUP(D92,Namen!A:B,2,0))","v":""},null,null,null,null,{"$f":"IF(D92=0,\"\",SUM(T92:W92))","v":""},{"$f":"IF(F92=0,\"\",MAX(F92:I92))","v":""},89,null,null,null,null,{"$f":"IF(ISERROR(VLOOKUP(D92,Namen!A:C,3,0)),\"Z\",VLOOKUP(D92,Namen!A:C,3,0))","v":"Z"},{"$f":"IF(ISERROR(VLOOKUP(D92,Namen!A:D,4,0)),\"Z\",VLOOKUP(D92,Namen!A:D,4,0))","v":"Z"},{"$f":"IF(R92=\"ja\",$A$1,0)","v":0},null,null,null,null,"","","","",""]
[{"$f":"IF(ISERROR(RANK(B93,$B$4:$B$203,0)),\"\",RANK(B93,$B$4:$B$203,0))","v":""},{"$f":"IF(COUNT(F93:I93)=1,SUM(F93:I93)-50,IF(COUNT(F93:I93)=2,SUM(F93:I93)-100,IF(COUNT(F93:I93)=3,SUM(F93:I93)-150,IF(COUNT(F93:I93)=4,SUM(F93:I93)-200,\"\"))))","v":""},{"$f":"IF(D93=\"\",\"\",L93)","v":""},null,{"$f":"IF(ISERROR(VLOOKUP(D93,Namen!A:B,2,0)),\"\",VLOOKUP(D93,Namen!A:B,2,0))","v":""},null,null,null,null,{"$f":"IF(D93=0,\"\",SUM(T93:W93))","v":""},{"$f":"IF(F93=0,\"\",MAX(F93:I93))","v":""},90,null,null,null,null,{"$f":"IF(ISERROR(VLOOKUP(D93,Namen!A:C,3,0)),\"Z\",VLOOKUP(D93,Namen!A:C,3,0))","v":"Z"},{"$f":"IF(ISERROR(VLOOKUP(D93,Namen!A:D,4,0)),\"Z\",VLOOKUP(D93,Namen!A:D,4,0))","v":"Z"},{"$f":"IF(R93=\"ja\",$A$1,0)","v":0},null,null,null,null,"","","","",""]
[{"$f":"IF(ISERROR(RANK(B94,$B$4:$B$203,0)),\"\",RANK(B94,$B$4:$B$203,0))","v":""},{"$f":"IF(COUNT(F94:I94)=1,SUM(F94:I94)-50,IF(COUNT(F94:I94)=2,SUM(F94:I94)-100,IF(COUNT(F94:I94)=3,SUM(F94:I94)-150,IF(COUNT(F94:I94)=4,SUM(F94:I94)-200,\"\"))))","v":""},{"$f":"IF(D94=\"\",\"\",L94)","v":""},null,{"$f":"IF(ISERROR(VLOOKUP(D94,Namen!A:B,2,0)),\"\",VLOOKUP(D94,Namen!A:B,2,0))","v":""},null,null,null,null,{"$f":"IF(D94=0,\"\",SUM(T94:W94))","v":""},{"$f":"IF(F94=0,\"\",MAX(F94:I94))","v":""},91,null,null,null,null,{"$f":"IF(ISERROR(VLOOKUP(D94,Namen!A:C,3,0)),\"Z\",VLOOKUP(D94,Namen!A:C,3,0))","v":"Z"},{"$f":"IF(ISERROR(VLOOKUP(D94,Namen!A:D,4,0)),\"Z\",VLOOKUP(D94,Namen!A:D,4,0))","v":"Z"},{"$f":"IF(R94=\"ja\",$A$1,0)","v":0},null,null,null,null,"","","","",""]
[{"$f":"IF(ISERROR(RANK(B95,$B$4:$B$203,0)),\"\",RANK(B95,$B$4:$B$203,0))","v":""},{"$f":"IF(COUNT(F95:I95)=1,SUM(F95:I95)-50,IF(COUNT(F95:I95)=2,SUM(F95:I95)-100,IF(COUNT(F95:I95)=3,SUM(F95:I95)-150,IF(COUNT(F95:I95)=4,SUM(F95:I95)-200,\"\"))))","v":""},{"$f":"IF(D95=\"\",\"\",L95)","v":""},null,{"$f":"IF(ISERROR(VLOOKUP(D95,Namen!A:B,2,0)),\"\",VLOOKUP(D95,Namen!A:B,2,0))","v":""},null,null,null,null,{"$f":"IF(D95=0,\"\",SUM(T95:W95))","v":""},{"$f":"IF(F95=0,\"\",MAX(F95:I95))","v":""},92,null,null,null,null,{"$f":"IF(ISERROR(VLOOKUP(D95,Namen!A:C,3,0)),\"Z\",VLOOKUP(D95,Namen!A:C,3,0))","v":"Z"},{"$f":"IF(ISERROR(VLOOKUP(D95,Namen!A:D,4,0)),\"Z\",VLOOKUP(D95,Namen!A:D,4,0))","v":"Z"},{"$f":"IF(R95=\"ja\",$A$1,0)","v":0},null,null,null,null,"","","","",""]
[{"$f":"IF(ISERROR(RANK(B96,$B$4:$B$203,0)),\"\",RANK(B96,$B$4:$B$203,0))","v":""},{"$f":"IF(COUNT(F96:I96)=1,SUM(F96:I96)-50,IF(COUNT(F96:I96)=2,SUM(F96:I96)-100,IF(COUNT(F96:I96)=3,SUM(F96:I96)-150,IF(COUNT(F96:I96)=4,SUM(F96:I96)-200,\"\"))))","v":""},{"$f":"IF(D96=\"\",\"\",L96)","v":""},null,{"$f":"IF(ISERROR(VLOOKUP(D96,Namen!A:B,2,0)),\"\",VLOOKUP(D96,Namen!A:B,2,0))","v":""},null,null,null,null,{"$f":"IF(D96=0,\"\",SUM(T96:W96))","v":""},{"$f":"IF(F96=0,\"\",MAX(F96:I96))","v":""},93,null,null,null,null,{"$f":"IF(ISERROR(VLOOKUP(D96,Namen!A:C,3,0)),\"Z\",VLOOKUP(D96,Namen!A:C,3,0))","v":"Z"},{"$f":"IF(ISERROR(VLOOKUP(D96,Namen!A:D,4,0)),\"Z\",VLOOKUP(D96,Namen!A:D,4,0))","v":"Z"},{"$f":"IF(R96=\"ja\",$A$1,0)","v":0},null,null,null,null,"","","","",""]
[{"$f":"IF(ISERROR(RANK(B97,$B$4:$B$203,0)),\"\",RANK(B97,$B$4:$B$203,0))","v":""},{"$f":"IF(COUNT(F97:I97)=1,SUM(F97:I97)-50,IF(COUNT(F97:I97)=2,SUM(F97:I97)-100,IF(COUNT(F97:I97)=3,SUM(F97:I97)-150,IF(COUNT(F97:I97)=4,SUM(F97:I97)-200,\"\"))))","v":""},{"$f":"IF(D97=\"\",\"\",L97)","v":""},null,{"$f":"IF(ISERROR(VLOOKUP(D97,Namen!A:B,2,0)),\"\",VLOOKUP(D97,Namen!A:B,2,0))","v":""},null,null,null,null,{"$f":"IF(D97=0,\"\",SUM(T97:W97))","v":""},{"$f":"IF(F97=0,\"\",MAX(F97:I97))","v":""},94,null,null,null,null,{"$f":"IF(ISERROR(VLOOKUP(D97,Namen!A:C,3,0)),\"Z\",VLOOKUP(D97,Namen!A:C,3,0))","v":"Z"},{"$f":"IF(ISERROR(VLOOKUP(D97,Namen!A:D,4,0)),\"Z\",VLOOKUP(D97,Namen!A:D,4,0))","v":"Z"},{"$f":"IF(R97=\"ja\",$A$1,0)","v":0},null,null,null,null,"","","","",""]
[{"$f":"IF(ISERROR(RANK(B98,$B$4:$B$203,0)),\"\",RANK(B98,$B$4:$B$203,0))","v":""},{"$f":"IF(COUNT(F98:I98)=1,SUM(F98:I98)-50,IF(COUNT(F98:I98)=2,SUM(F98:I98)-100,IF(COUNT(F98:I98)=3,SUM(F98:I98)-150,IF(COUNT(F98:I98)=4,SUM(F98:I98)-200,\"\"))))","v":""},{"$f":"IF(D98=\"\",\"\",L98)","v":""},null,{"$f":"IF(ISERROR(VLOOKUP(D98,Namen!A:B,2,0)),\"\",VLOOKUP(D98,Namen!A:B,2,0))","v":""},null,null,null,null,{"$f":"IF(D98=0,\"\",SUM(T98:W98))","v":""},{"$f":"IF(F98=0,\"\",MAX(F98:I98))","v":""},95,null,null,null,null,{"$f":"IF(ISERROR(VLOOKUP(D98,Namen!A:C,3,0)),\"Z\",VLOOKUP(D98,Namen!A:C,3,0))","v":"Z"},{"$f":"IF(ISERROR(VLOOKUP(D98,Namen!A:D,4,0)),\"Z\",VLOOKUP(D98,Namen!A:D,4,0))","v":"Z"},{"$f":"IF(R98=\"ja\",$A$1,0)","v":0},null,null,null,null,"","","","",""]
[{"$f":"IF(ISERROR(RANK(B99,$B$4:$B$203,0)),\"\",RANK(B99,$B$4:$B$203,0))","v":""},{"$f":"IF(COUNT(F99:I99)=1,SUM(F99:I99)-50,IF(COUNT(F99:I99)=2,SUM(F99:I99)-100,IF(COUNT(F99:I99)=3,SUM(F99:I99)-150,IF(COUNT(F99:I99)=4,SUM(F99:I99)-200,\"\"))))","v":""},{"$f":"IF(D99=\"\",\"\",L99)","v":""},null,{"$f":"IF(ISERROR(VLOOKUP(D99,Namen!A:B,2,0)),\"\",VLOOKUP(D99,Namen!A:B,2,0))","v":""},null,null,null,null,{"$f":"IF(D99=0,\"\",SUM(T99:W99))","v":""},{"$f":"IF(F99=0,\"\",MAX(F99:I99))","v":""},96,null,null,null,null,{"$f":"IF(ISERROR(VLOOKUP(D99,Namen!A:C,3,0)),\"Z\",VLOOKUP(D99,Namen!A:C,3,0))","v":"Z"},{"$f":"IF(ISERROR(VLOOKUP(D99,Namen!A:D,4,0)),\"Z\",VLOOKUP(D99,Namen!A:D,4,0))","v":"Z"},{"$f":"IF(R99=\"ja\",$A$1,0)","v":0},null,null,null,null,"","","","",""]
[{"$f":"IF(ISERROR(RANK(B100,$B$4:$B$203,0)),\"\",RANK(B100,$B$4:$B$203,0))","v":""},{"$f":"IF(COUNT(F100:I100)=1,SUM(F100:I100)-50,IF(COUNT(F100:I100)=2,SUM(F100:I100)-100,IF(COUNT(F100:I100)=3,SUM(F100:I100)-150,IF(COUNT(F100:I100)=4,SUM(F100:I100)-200,\"\"))))","v":""},{"$f":"IF(D100=\"\",\"\",L100)","v":""},null,{"$f":"IF(ISERROR(VLOOKUP(D100,Namen!A:B,2,0)),\"\",VLOOKUP(D100,Namen!A:B,2,0))","v":""},null,null,null,null,{"$f":"IF(D100=0,\"\",SUM(T100:W100))","v":""},{"$f":"IF(F100=0,\"\",MAX(F100:I100))","v":""},97,null,null,null,null,{"$f":"IF(ISERROR(VLOOKUP(D100,Namen!A:C,3,0)),\"Z\",VLOOKUP(D100,Namen!A:C,3,0))","v":"Z"},{"$f":"IF(ISERROR(VLOOKUP(D100,Namen!A:D,4,0)),\"Z\",VLOOKUP(D100,Namen!A:D,4,0))","v":"Z"},{"$f":"IF(R100=\"ja\",$A$1,0)","v":0},null,null,null,null,"","","","",""]
[{"$f":"IF(ISERROR(RANK(B101,$B$4:$B$203,0)),\"\",RANK(B101,$B$4:$B$203,0))","v":""},{"$f":"IF(COUNT(F101:I101)=1,SUM(F101:I101)-50,IF(COUNT(F101:I101)=2,SUM(F101:I101)-100,IF(COUNT(F101:I101)=3,SUM(F101:I101)-150,IF(COUNT(F101:I101)=4,SUM(F101:I101)-200,\"\"))))","v":""},{"$f":"IF(D101=\"\",\"\",L101)","v":""},null,{"$f":"IF(ISERROR(VLOOKUP(D101,Namen!A:B,2,0)),\"\",VLOOKUP(D101,Namen!A:B,2,0))","v":""},null,null,null,null,{"$f":"IF(D101=0,\"\",SUM(T101:W101))","v":""},{"$f":"IF(F101=0,\"\",MAX(F101:I101))","v":""},98,null,null,null,null,{"$f":"IF(ISERROR(VLOOKUP(D101,Namen!A:C,3,0)),\"Z\",VLOOKUP(D101,Namen!A:C,3,0))","v":"Z"},{"$f":"IF(ISERROR(VLOOKUP(D101,Namen!A:D,4,0)),\"Z\",VLOOKUP(D101,Namen!A:D,4,0))","v":"Z"},{"$f":"IF(R101=\"ja\",$A$1,0)","v":0},null,null,null,null,"","","","",""]
[{"$f":"IF(ISERROR(RANK(B102,$B$4:$B$203,0)),\"\",RANK(B102,$B$4:$B$203,0))","v":""},{"$f":"IF(COUNT(F102:I102)=1,SUM(F102:I102)-50,IF(COUNT(F102:I102)=2,SUM(F102:I102)-100,IF(COUNT(F102:I102)=3,SUM(F102:I102)-150,IF(COUNT(F102:I102)=4,SUM(F102:I102)-200,\"\"))))","v":""},{"$f":"IF(D102=\"\",\"\",L102)","v":""},null,{"$f":"IF(ISERROR(VLOOKUP(D102,Namen!A:B,2,0)),\"\",VLOOKUP(D102,Namen!A:B,2,0))","v":""},null,null,null,null,{"$f":"IF(D102=0,\"\",SUM(T102:W102))","v":""},{"$f":"IF(F102=0,\"\",MAX(F102:I102))","v":""},99,null,null,null,null,{"$f":"IF(ISERROR(VLOOKUP(D102,Namen!A:C,3,0)),\"Z\",VLOOKUP(D102,Namen!A:C,3,0))","v":"Z"},{"$f":"IF(ISERROR(VLOOKUP(D102,Namen!A:D,4,0)),\"Z\",VLOOKUP(D102,Namen!A:D,4,0))","v":"Z"},{"$f":"IF(R102=\"ja\",$A$1,0)","v":0},null,null,null,null,"","","","",""]
[{"$f":"IF(ISERROR(RANK(B103,$B$4:$B$203,0)),\"\",RANK(B103,$B$4:$B$203,0))","v":""},{"$f":"IF(COUNT(F103:I103)=1,SUM(F103:I103)-50,IF(COUNT(F103:I103)=2,SUM(F103:I103)-100,IF(COUNT(F103:I103)=3,SUM(F103:I103)-150,IF(COUNT(F103:I103)=4,SUM(F103:I103)-200,\"\"))))","v":""},{"$f":"IF(D103=\"\",\"\",L103)","v":""},null,{"$f":"IF(ISERROR(VLOOKUP(D103,Namen!A:B,2,0)),\"\",VLOOKUP(D103,Namen!A:B,2,0))","v":""},null,null,null,null,{"$f":"IF(D103=0,\"\",SUM(T103:W103))","v":""},{"$f":"IF(F103=0,\"\",MAX(F103:I103))","v":""},100,null,null,null,null,{"$f":"IF(ISERROR(VLOOKUP(D103,Namen!A:C,3,0)),\"Z\",VLOOKUP(D103,Namen!A:C,3,0))","v":"Z"},{"$f":"IF(ISERROR(VLOOKUP(D103,Namen!A:D,4,0)),\"Z\",VLOOKUP(D103,Namen!A:D,4,0))","v":"Z"},{"$f":"IF(R103=\"ja\",$A$1,0)","v":0},null,null,null,null,"","","","",""]
[{"$f":"IF(ISERROR(RANK(B104,$B$4:$B$203,0)),\"\",RANK(B104,$B$4:$B$203,0))","v":""},{"$f":"IF(COUNT(F104:I104)=1,SUM(F104:I104)-50,IF(COUNT(F104:I104)=2,SUM(F104:I104)-100,IF(COUNT(F104:I104)=3,SUM(F104:I104)-150,IF(COUNT(F104:I104)=4,SUM(F104:I104)-200,\"\"))))","v":""},{"$f":"IF(D104=\"\",\"\",L104)","v":""},null,{"$f":"IF(ISERROR(VLOOKUP(D104,Namen!A:B,2,0)),\"\",VLOOKUP(D104,Namen!A:B,2,0))","v":""},null,null,null,null,{"$f":"IF(D104=0,\"\",SUM(T104:W104))","v":""},{"$f":"IF(F104=0,\"\",MAX(F104:I104))","v":""},101,null,null,null,null,{"$f":"IF(ISERROR(VLOOKUP(D104,Namen!A:C,3,0)),\"Z\",VLOOKUP(D104,Namen!A:C,3,0))","v":"Z"},{"$f":"IF(ISERROR(VLOOKUP(D104,Namen!A:D,4,0)),\"Z\",VLOOKUP(D104,Namen!A:D,4,0))","v":"Z"},{"$f":"IF(R104=\"ja\",$A$1,0)","v":0},null,null,null,null,"","","","",""]
[{"$f":"IF(ISERROR(RANK(B105,$B$4:$B$203,0)),\"\",RANK(B105,$B$4:$B$203,0))","v":""},{"$f":"IF(COUNT(F105:I105)=1,SUM(F105:I105)-50,IF(COUNT(F105:I105)=2,SUM(F105:I105)-100,IF(COUNT(F105:I105)=3,SUM(F105:I105)-150,IF(COUNT(F105:I105)=4,SUM(F105:I105)-200,\"\"))))","v":""},{"$f":"IF(D105=\"\",\"\",L105)","v":""},null,{"$f":"IF(ISERROR(VLOOKUP(D105,Namen!A:B,2,0)),\"\",VLOOKUP(D105,Namen!A:B,2,0))","v":""},null,null,null,null,{"$f":"IF(D105=0,\"\",SUM(T105:W105))","v":""},{"$f":"IF(F105=0,\"\",MAX(F105:I105))","v":""},102,null,null,null,null,{"$f":"IF(ISERROR(VLOOKUP(D105,Namen!A:C,3,0)),\"Z\",VLOOKUP(D105,Namen!A:C,3,0))","v":"Z"},{"$f":"IF(ISERROR(VLOOKUP(D105,Namen!A:D,4,0)),\"Z\",VLOOKUP(D105,Namen!A:D,4,0))","v":"Z"},{"$f":"IF(R105=\"ja\",$A$1,0)","v":0},null,null,null,null,"","","","",""]
[{"$f":"IF(ISERROR(RANK(B106,$B$4:$B$203,0)),\"\",RANK(B106,$B$4:$B$203,0))","v":""},{"$f":"IF(COUNT(F106:I106)=1,SUM(F106:I106)-50,IF(COUNT(F106:I106)=2,SUM(F106:I106)-100,IF(COUNT(F106:I106)=3,SUM(F106:I106)-150,IF(COUNT(F106:I106)=4,SUM(F106:I106)-200,\"\"))))","v":""},{"$f":"IF(D106=\"\",\"\",L106)","v":""},null,{"$f":"IF(ISERROR(VLOOKUP(D106,Namen!A:B,2,0)),\"\",VLOOKUP(D106,Namen!A:B,2,0))","v":""},null,null,null,null,{"$f":"IF(D106=0,\"\",SUM(T106:W106))","v":""},{"$f":"IF(F106=0,\"\",MAX(F106:I106))","v":""},103,null,null,null,null,{"$f":"IF(ISERROR(VLOOKUP(D106,Namen!A:C,3,0)),\"Z\",VLOOKUP(D106,Namen!A:C,3,0))","v":"Z"},{"$f":"IF(ISERROR(VLOOKUP(D106,Namen!A:D,4,0)),\"Z\",VLOOKUP(D106,Namen!A:D,4,0))","v":"Z"},{"$f":"IF(R106=\"ja\",$A$1,0)","v":0},null,null,null,null,{"$f":"IFERROR(B106+(K106*0.0001),\"\")","v":""},"","","",""]
[{"$f":"IF(ISERROR(RANK(B107,$B$4:$B$203,0)),\"\",RANK(B107,$B$4:$B$203,0))","v":""},{"$f":"IF(COUNT(F107:I107)=1,SUM(F107:I107)-50,IF(COUNT(F107:I107)=2,SUM(F107:I107)-100,IF(COUNT(F107:I107)=3,SUM(F107:I107)-150,IF(COUNT(F107:I107)=4,SUM(F107:I107)-200,\"\"))))","v":""},{"$f":"IF(D107=\"\",\"\",L107)","v":""},null,{"$f":"IF(ISERROR(VLOOKUP(D107,Namen!A:B,2,0)),\"\",VLOOKUP(D107,Namen!A:B,2,0))","v":""},null,null,null,null,{"$f":"IF(D107=0,\"\",SUM(T107:W107))","v":""},{"$f":"IF(F107=0,\"\",MAX(F107:I107))","v":""},104,null,null,null,null,{"$f":"IF(ISERROR(VLOOKUP(D107,Namen!A:C,3,0)),\"Z\",VLOOKUP(D107,Namen!A:C,3,0))","v":"Z"},{"$f":"IF(ISERROR(VLOOKUP(D107,Namen!A:D,4,0)),\"Z\",VLOOKUP(D107,Namen!A:D,4,0))","v":"Z"},{"$f":"IF(R107=\"ja\",$A$1,0)","v":0},null,null,null,null,"","","","",""]
[{"$f":"IF(ISERROR(RANK(B108,$B$4:$B$203,0)),\"\",RANK(B108,$B$4:$B$203,0))","v":""},{"$f":"IF(COUNT(F108:I108)=1,SUM(F108:I108)-50,IF(COUNT(F108:I108)=2,SUM(F108:I108)-100,IF(COUNT(F108:I108)=3,SUM(F108:I108)-150,IF(COUNT(F108:I108)=4,SUM(F108:I108)-200,\"\"))))","v":""},{"$f":"IF(D108=\"\",\"\",L108)","v":""},null,{"$f":"IF(ISERROR(VLOOKUP(D108,Namen!A:B,2,0)),\"\",VLOOKUP(D108,Namen!A:B,2,0))","v":""},null,null,null,null,{"$f":"IF(D108=0,\"\",SUM(T108:W108))","v":""},{"$f":"IF(F108=0,\"\",MAX(F108:I108))","v":""},105,null,null,null,null,{"$f":"IF(ISERROR(VLOOKUP(D108,Namen!A:C,3,0)),\"Z\",VLOOKUP(D108,Namen!A:C,3,0))","v":"Z"},{"$f":"IF(ISERROR(VLOOKUP(D108,Namen!A:D,4,0)),\"Z\",VLOOKUP(D108,Namen!A:D,4,0))","v":"Z"},{"$f":"IF(R108=\"ja\",$A$1,0)","v":0},null,null,null,null,"","","","",""]
[{"$f":"IF(ISERROR(RANK(B109,$B$4:$B$203,0)),\"\",RANK(B109,$B$4:$B$203,0))","v":""},{"$f":"IF(COUNT(F109:I109)=1,SUM(F109:I109)-50,IF(COUNT(F109:I109)=2,SUM(F109:I109)-100,IF(COUNT(F109:I109)=3,SUM(F109:I109)-150,IF(COUNT(F109:I109)=4,SUM(F109:I109)-200,\"\"))))","v":""},{"$f":"IF(D109=\"\",\"\",L109)","v":""},null,{"$f":"IF(ISERROR(VLOOKUP(D109,Namen!A:B,2,0)),\"\",VLOOKUP(D109,Namen!A:B,2,0))","v":""},null,null,null,null,{"$f":"IF(D109=0,\"\",SUM(T109:W109))","v":""},{"$f":"IF(F109=0,\"\",MAX(F109:I109))","v":""},106,null,null,null,null,{"$f":"IF(ISERROR(VLOOKUP(D109,Namen!A:C,3,0)),\"Z\",VLOOKUP(D109,Namen!A:C,3,0))","v":"Z"},{"$f":"IF(ISERROR(VLOOKUP(D109,Namen!A:D,4,0)),\"Z\",VLOOKUP(D109,Namen!A:D,4,0))","v":"Z"},{"$f":"IF(R109=\"ja\",$A$1,0)","v":0},null,null,null,null,"","","","",""]
[{"$f":"IF(ISERROR(RANK(B110,$B$4:$B$203,0)),\"\",RANK(B110,$B$4:$B$203,0))","v":""},{"$f":"IF(COUNT(F110:I110)=1,SUM(F110:I110)-50,IF(COUNT(F110:I110)=2,SUM(F110:I110)-100,IF(COUNT(F110:I110)=3,SUM(F110:I110)-150,IF(COUNT(F110:I110)=4,SUM(F110:I110)-200,\"\"))))","v":""},{"$f":"IF(D110=\"\",\"\",L110)","v":""},null,{"$f":"IF(ISERROR(VLOOKUP(D110,Namen!A:B,2,0)),\"\",VLOOKUP(D110,Namen!A:B,2,0))","v":""},null,null,null,null,{"$f":"IF(D110=0,\"\",SUM(T110:W110))","v":""},{"$f":"IF(F110=0,\"\",MAX(F110:I110))","v":""},107,null,null,null,null,{"$f":"IF(ISERROR(VLOOKUP(D110,Namen!A:C,3,0)),\"Z\",VLOOKUP(D110,Namen!A:C,3,0))","v":"Z"},{"$f":"IF(ISERROR(VLOOKUP(D110,Namen!A:D,4,0)),\"Z\",VLOOKUP(D110,Namen!A:D,4,0))","v":"Z"},{"$f":"IF(R110=\"ja\",$A$1,0)","v":0},null,null,null,null,"","","","",""]
[{"$f":"IF(ISERROR(RANK(B111,$B$4:$B$203,0)),\"\",RANK(B111,$B$4:$B$203,0))","v":""},{"$f":"IF(COUNT(F111:I111)=1,SUM(F111:I111)-50,IF(COUNT(F111:I111)=2,SUM(F111:I111)-100,IF(COUNT(F111:I111)=3,SUM(F111:I111)-150,IF(COUNT(F111:I111)=4,SUM(F111:I111)-200,\"\"))))","v":""},{"$f":"IF(D111=\"\",\"\",L111)","v":""},null,{"$f":"IF(ISERROR(VLOOKUP(D111,Namen!A:B,2,0)),\"\",VLOOKUP(D111,Namen!A:B,2,0))","v":""},null,null,null,null,{"$f":"IF(D111=0,\"\",SUM(T111:W111))","v":""},{"$f":"IF(F111=0,\"\",MAX(F111:I111))","v":""},108,null,null,null,null,{"$f":"IF(ISERROR(VLOOKUP(D111,Namen!A:C,3,0)),\"Z\",VLOOKUP(D111,Namen!A:C,3,0))","v":"Z"},{"$f":"IF(ISERROR(VLOOKUP(D111,Namen!A:D,4,0)),\"Z\",VLOOKUP(D111,Namen!A:D,4,0))","v":"Z"},{"$f":"IF(R111=\"ja\",$A$1,0)","v":0},null,null,null,null,"","","","",""]
[{"$f":"IF(ISERROR(RANK(B112,$B$4:$B$203,0)),\"\",RANK(B112,$B$4:$B$203,0))","v":""},{"$f":"IF(COUNT(F112:I112)=1,SUM(F112:I112)-50,IF(COUNT(F112:I112)=2,SUM(F112:I112)-100,IF(COUNT(F112:I112)=3,SUM(F112:I112)-150,IF(COUNT(F112:I112)=4,SUM(F112:I112)-200,\"\"))))","v":""},{"$f":"IF(D112=\"\",\"\",L112)","v":""},null,{"$f":"IF(ISERROR(VLOOKUP(D112,Namen!A:B,2,0)),\"\",VLOOKUP(D112,Namen!A:B,2,0))","v":""},null,null,null,null,{"$f":"IF(D112=0,\"\",SUM(T112:W112))","v":""},{"$f":"IF(F112=0,\"\",MAX(F112:I112))","v":""},109,null,null,null,null,{"$f":"IF(ISERROR(VLOOKUP(D112,Namen!A:C,3,0)),\"Z\",VLOOKUP(D112,Namen!A:C,3,0))","v":"Z"},{"$f":"IF(ISERROR(VLOOKUP(D112,Namen!A:D,4,0)),\"Z\",VLOOKUP(D112,Namen!A:D,4,0))","v":"Z"},{"$f":"IF(R112=\"ja\",$A$1,0)","v":0},null,null,null,null,"","","","",""]
[{"$f":"IF(ISERROR(RANK(B113,$B$4:$B$203,0)),\"\",RANK(B113,$B$4:$B$203,0))","v":""},{"$f":"IF(COUNT(F113:I113)=1,SUM(F113:I113)-50,IF(COUNT(F113:I113)=2,SUM(F113:I113)-100,IF(COUNT(F113:I113)=3,SUM(F113:I113)-150,IF(COUNT(F113:I113)=4,SUM(F113:I113)-200,\"\"))))","v":""},{"$f":"IF(D113=\"\",\"\",L113)","v":""},null,{"$f":"IF(ISERROR(VLOOKUP(D113,Namen!A:B,2,0)),\"\",VLOOKUP(D113,Namen!A:B,2,0))","v":""},null,null,null,null,{"$f":"IF(D113=0,\"\",SUM(T113:W113))","v":""},{"$f":"IF(F113=0,\"\",MAX(F113:I113))","v":""},110,null,null,null,null,{"$f":"IF(ISERROR(VLOOKUP(D113,Namen!A:C,3,0)),\"Z\",VLOOKUP(D113,Namen!A:C,3,0))","v":"Z"},{"$f":"IF(ISERROR(VLOOKUP(D113,Namen!A:D,4,0)),\"Z\",VLOOKUP(D113,Namen!A:D,4,0))","v":"Z"},{"$f":"IF(R113=\"ja\",$A$1,0)","v":0},null,null,null,null,"","","","",""]
[{"$f":"IF(ISERROR(RANK(B114,$B$4:$B$203,0)),\"\",RANK(B114,$B$4:$B$203,0))","v":""},{"$f":"IF(COUNT(F114:I114)=1,SUM(F114:I114)-50,IF(COUNT(F114:I114)=2,SUM(F114:I114)-100,IF(COUNT(F114:I114)=3,SUM(F114:I114)-150,IF(COUNT(F114:I114)=4,SUM(F114:I114)-200,\"\"))))","v":""},{"$f":"IF(D114=\"\",\"\",L114)","v":""},null,{"$f":"IF(ISERROR(VLOOKUP(D114,Namen!A:B,2,0)),\"\",VLOOKUP(D114,Namen!A:B,2,0))","v":""},null,null,null,null,{"$f":"IF(D114=0,\"\",SUM(T114:W114))","v":""},{"$f":"IF(F114=0,\"\",MAX(F114:I114))","v":""},111,null,null,null,null,{"$f":"IF(ISERROR(VLOOKUP(D114,Namen!A:C,3,0)),\"Z\",VLOOKUP(D114,Namen!A:C,3,0))","v":"Z"},{"$f":"IF(ISERROR(VLOOKUP(D114,Namen!A:D,4,0)),\"Z\",VLOOKUP(D114,Namen!A:D,4,0))","v":"Z"},{"$f":"IF(R114=\"ja\",$A$1,0)","v":0},null,null,null,null,"","","","",""]
[{"$f":"IF(ISERROR(RANK(B115,$B$4:$B$203,0)),\"\",RANK(B115,$B$4:$B$203,0))","v":""},{"$f":"IF(COUNT(F115:I115)=1,SUM(F115:I115)-50,IF(COUNT(F115:I115)=2,SUM(F115:I115)-100,IF(COUNT(F115:I115)=3,SUM(F115:I115)-150,IF(COUNT(F115:I115)=4,SUM(F115:I115)-200,\"\"))))","v":""},{"$f":"IF(D115=\"\",\"\",L115)","v":""},null,{"$f":"IF(ISERROR(VLOOKUP(D115,Namen!A:B,2,0)),\"\",VLOOKUP(D115,Namen!A:B,2,0))","v":""},null,null,null,null,{"$f":"IF(D115=0,\"\",SUM(T115:W115))","v":""},{"$f":"IF(F115=0,\"\",MAX(F115:I115))","v":""},112,null,null,null,null,{"$f":"IF(ISERROR(VLOOKUP(D115,Namen!A:C,3,0)),\"Z\",VLOOKUP(D115,Namen!A:C,3,0))","v":"Z"},{"$f":"IF(ISERROR(VLOOKUP(D115,Namen!A:D,4,0)),\"Z\",VLOOKUP(D115,Namen!A:D,4,0))","v":"Z"},{"$f":"IF(R115=\"ja\",$A$1,0)","v":0},null,null,null,null,"","","","",""]
[{"$f":"IF(ISERROR(RANK(B116,$B$4:$B$203,0)),\"\",RANK(B116,$B$4:$B$203,0))","v":""},{"$f":"IF(COUNT(F116:I116)=1,SUM(F116:I116)-50,IF(COUNT(F116:I116)=2,SUM(F116:I116)-100,IF(COUNT(F116:I116)=3,SUM(F116:I116)-150,IF(COUNT(F116:I116)=4,SUM(F116:I116)-200,\"\"))))","v":""},{"$f":"IF(D116=\"\",\"\",L116)","v":""},null,{"$f":"IF(ISERROR(VLOOKUP(D116,Namen!A:B,2,0)),\"\",VLOOKUP(D116,Namen!A:B,2,0))","v":""},null,null,null,null,{"$f":"IF(D116=0,\"\",SUM(T116:W116))","v":""},{"$f":"IF(F116=0,\"\",MAX(F116:I116))","v":""},113,null,null,null,null,{"$f":"IF(ISERROR(VLOOKUP(D116,Namen!A:C,3,0)),\"Z\",VLOOKUP(D116,Namen!A:C,3,0))","v":"Z"},{"$f":"IF(ISERROR(VLOOKUP(D116,Namen!A:D,4,0)),\"Z\",VLOOKUP(D116,Namen!A:D,4,0))","v":"Z"},{"$f":"IF(R116=\"ja\",$A$1,0)","v":0},null,null,null,null,"","","","",""]
[{"$f":"IF(ISERROR(RANK(B117,$B$4:$B$203,0)),\"\",RANK(B117,$B$4:$B$203,0))","v":""},{"$f":"IF(COUNT(F117:I117)=1,SUM(F117:I117)-50,IF(COUNT(F117:I117)=2,SUM(F117:I117)-100,IF(COUNT(F117:I117)=3,SUM(F117:I117)-150,IF(COUNT(F117:I117)=4,SUM(F117:I117)-200,\"\"))))","v":""},{"$f":"IF(D117=\"\",\"\",L117)","v":""},null,{"$f":"IF(ISERROR(VLOOKUP(D117,Namen!A:B,2,0)),\"\",VLOOKUP(D117,Namen!A:B,2,0))","v":""},null,null,null,null,{"$f":"IF(D117=0,\"\",SUM(T117:W117))","v":""},{"$f":"IF(F117=0,\"\",MAX(F117:I117))","v":""},114,null,null,null,null,{"$f":"IF(ISERROR(VLOOKUP(D117,Namen!A:C,3,0)),\"Z\",VLOOKUP(D117,Namen!A:C,3,0))","v":"Z"},{"$f":"IF(ISERROR(VLOOKUP(D117,Namen!A:D,4,0)),\"Z\",VLOOKUP(D117,Namen!A:D,4,0))","v":"Z"},{"$f":"IF(R117=\"ja\",$A$1,0)","v":0},null,null,null,null,"","","","",""]
[{"$f":"IF(ISERROR(RANK(B118,$B$4:$B$203,0)),\"\",RANK(B118,$B$4:$B$203,0))","v":""},{"$f":"IF(COUNT(F118:I118)=1,SUM(F118:I118)-50,IF(COUNT(F118:I118)=2,SUM(F118:I118)-100,IF(COUNT(F118:I118)=3,SUM(F118:I118)-150,IF(COUNT(F118:I118)=4,SUM(F118:I118)-200,\"\"))))","v":""},{"$f":"IF(D118=\"\",\"\",L118)","v":""},null,{"$f":"IF(ISERROR(VLOOKUP(D118,Namen!A:B,2,0)),\"\",VLOOKUP(D118,Namen!A:B,2,0))","v":""},null,null,null,null,{"$f":"IF(D118=0,\"\",SUM(T118:W118))","v":""},{"$f":"IF(F118=0,\"\",MAX(F118:I118))","v":""},115,null,null,null,null,{"$f":"IF(ISERROR(VLOOKUP(D118,Namen!A:C,3,0)),\"Z\",VLOOKUP(D118,Namen!A:C,3,0))","v":"Z"},{"$f":"IF(ISERROR(VLOOKUP(D118,Namen!A:D,4,0)),\"Z\",VLOOKUP(D118,Namen!A:D,4,0))","v":"Z"},{"$f":"IF(R118=\"ja\",$A$1,0)","v":0},null,null,null,null,"","","","",""]
[{"$f":"IF(ISERROR(RANK(B119,$B$4:$B$203,0)),\"\",RANK(B119,$B$4:$B$203,0))","v":""},{"$f":"IF(COUNT(F119:I119)=1,SUM(F119:I119)-50,IF(COUNT(F119:I119)=2,SUM(F119:I119)-100,IF(COUNT(F119:I119)=3,SUM(F119:I119)-150,IF(COUNT(F119:I119)=4,SUM(F119:I119)-200,\"\"))))","v":""},{"$f":"IF(D119=\"\",\"\",L119)","v":""},null,{"$f":"IF(ISERROR(VLOOKUP(D119,Namen!A:B,2,0)),\"\",VLOOKUP(D119,Namen!A:B,2,0))","v":""},null,null,null,null,{"$f":"IF(D119=0,\"\",SUM(T119:W119))","v":""},{"$f":"IF(F119=0,\"\",MAX(F119:I119))","v":""},116,null,null,null,null,{"$f":"IF(ISERROR(VLOOKUP(D119,Namen!A:C,3,0)),\"Z\",VLOOKUP(D119,Namen!A:C,3,0))","v":"Z"},{"$f":"IF(ISERROR(VLOOKUP(D119,Namen!A:D,4,0)),\"Z\",VLOOKUP(D119,Namen!A:D,4,0))","v":"Z"},{"$f":"IF(R119=\"ja\",$A$1,0)","v":0},null,null,null,null,"","","","",""]
[{"$f":"IF(ISERROR(RANK(B120,$B$4:$B$203,0)),\"\",RANK(B120,$B$4:$B$203,0))","v":""},{"$f":"IF(COUNT(F120:I120)=1,SUM(F120:I120)-50,IF(COUNT(F120:I120)=2,SUM(F120:I120)-100,IF(COUNT(F120:I120)=3,SUM(F120:I120)-150,IF(COUNT(F120:I120)=4,SUM(F120:I120)-200,\"\"))))","v":""},{"$f":"IF(D120=\"\",\"\",L120)","v":""},null,{"$f":"IF(ISERROR(VLOOKUP(D120,Namen!A:B,2,0)),\"\",VLOOKUP(D120,Namen!A:B,2,0))","v":""},null,null,null,null,{"$f":"IF(D120=0,\"\",SUM(T120:W120))","v":""},{"$f":"IF(F120=0,\"\",MAX(F120:I120))","v":""},117,null,null,null,null,{"$f":"IF(ISERROR(VLOOKUP(D120,Namen!A:C,3,0)),\"Z\",VLOOKUP(D120,Namen!A:C,3,0))","v":"Z"},{"$f":"IF(ISERROR(VLOOKUP(D120,Namen!A:D,4,0)),\"Z\",VLOOKUP(D120,Namen!A:D,4,0))","v":"Z"},{"$f":"IF(R120=\"ja\",$A$1,0)","v":0},null,null,null,null,"","","","",""]
[{"$f":"IF(ISERROR(RANK(B121,$B$4:$B$203,0)),\"\",RANK(B121,$B$4:$B$203,0))","v":""},{"$f":"IF(COUNT(F121:I121)=1,SUM(F121:I121)-50,IF(COUNT(F121:I121)=2,SUM(F121:I121)-100,IF(COUNT(F121:I121)=3,SUM(F121:I121)-150,IF(COUNT(F121:I121)=4,SUM(F121:I121)-200,\"\"))))","v":""},{"$f":"IF(D121=\"\",\"\",L121)","v":""},null,{"$f":"IF(ISERROR(VLOOKUP(D121,Namen!A:B,2,0)),\"\",VLOOKUP(D121,Namen!A:B,2,0))","v":""},null,null,null,null,{"$f":"IF(D121=0,\"\",SUM(T121:W121))","v":""},{"$f":"IF(F121=0,\"\",MAX(F121:I121))","v":""},118,null,null,null,null,{"$f":"IF(ISERROR(VLOOKUP(D121,Namen!A:C,3,0)),\"Z\",VLOOKUP(D121,Namen!A:C,3,0))","v":"Z"},{"$f":"IF(ISERROR(VLOOKUP(D121,Namen!A:D,4,0)),\"Z\",VLOOKUP(D121,Namen!A:D,4,0))","v":"Z"},{"$f":"IF(R121=\"ja\",$A$1,0)","v":0},null,null,null,null,"","","","",""]
[{"$f":"IF(ISERROR(RANK(B122,$B$4:$B$203,0)),\"\",RANK(B122,$B$4:$B$203,0))","v":""},{"$f":"IF(COUNT(F122:I122)=1,SUM(F122:I122)-50,IF(COUNT(F122:I122)=2,SUM(F122:I122)-100,IF(COUNT(F122:I122)=3,SUM(F122:I122)-150,IF(COUNT(F122:I122)=4,SUM(F122:I122)-200,\"\"))))","v":""},{"$f":"IF(D122=\"\",\"\",L122)","v":""},null,{"$f":"IF(ISERROR(VLOOKUP(D122,Namen!A:B,2,0)),\"\",VLOOKUP(D122,Namen!A:B,2,0))","v":""},null,null,null,null,{"$f":"IF(D122=0,\"\",SUM(T122:W122))","v":""},{"$f":"IF(F122=0,\"\",MAX(F122:I122))","v":""},119,null,null,null,null,{"$f":"IF(ISERROR(VLOOKUP(D122,Namen!A:C,3,0)),\"Z\",VLOOKUP(D122,Namen!A:C,3,0))","v":"Z"},{"$f":"IF(ISERROR(VLOOKUP(D122,Namen!A:D,4,0)),\"Z\",VLOOKUP(D122,Namen!A:D,4,0))","v":"Z"},{"$f":"IF(R122=\"ja\",$A$1,0)","v":0},null,null,null,null,"","","","",""]
[{"$f":"IF(ISERROR(RANK(B123,$B$4:$B$203,0)),\"\",RANK(B123,$B$4:$B$203,0))","v":""},{"$f":"IF(COUNT(F123:I123)=1,SUM(F123:I123)-50,IF(COUNT(F123:I123)=2,SUM(F123:I123)-100,IF(COUNT(F123:I123)=3,SUM(F123:I123)-150,IF(COUNT(F123:I123)=4,SUM(F123:I123)-200,\"\"))))","v":""},{"$f":"IF(D123=\"\",\"\",L123)","v":""},null,{"$f":"IF(ISERROR(VLOOKUP(D123,Namen!A:B,2,0)),\"\",VLOOKUP(D123,Namen!A:B,2,0))","v":""},null,null,null,null,{"$f":"IF(D123=0,\"\",SUM(T123:W123))","v":""},{"$f":"IF(F123=0,\"\",MAX(F123:I123))","v":""},120,null,null,null,null,{"$f":"IF(ISERROR(VLOOKUP(D123,Namen!A:C,3,0)),\"Z\",VLOOKUP(D123,Namen!A:C,3,0))","v":"Z"},{"$f":"IF(ISERROR(VLOOKUP(D123,Namen!A:D,4,0)),\"Z\",VLOOKUP(D123,Namen!A:D,4,0))","v":"Z"},{"$f":"IF(R123=\"ja\",$A$1,0)","v":0},null,null,null,null,"","","","",""]
[{"$f":"IF(ISERROR(RANK(B124,$B$4:$B$203,0)),\"\",RANK(B124,$B$4:$B$203,0))","v":""},{"$f":"IF(COUNT(F124:I124)=1,SUM(F124:I124)-50,IF(COUNT(F124:I124)=2,SUM(F124:I124)-100,IF(COUNT(F124:I124)=3,SUM(F124:I124)-150,IF(COUNT(F124:I124)=4,SUM(F124:I124)-200,\"\"))))","v":""},{"$f":"IF(D124=\"\",\"\",L124)","v":""},null,{"$f":"IF(ISERROR(VLOOKUP(D124,Namen!A:B,2,0)),\"\",VLOOKUP(D124,Namen!A:B,2,0))","v":""},null,null,null,null,{"$f":"IF(D124=0,\"\",SUM(T124:W124))","v":""},{"$f":"IF(F124=0,\"\",MAX(F124:I124))","v":""},121,null,null,null,null,{"$f":"IF(ISERROR(VLOOKUP(D124,Namen!A:C,3,0)),\"Z\",VLOOKUP(D124,Namen!A:C,3,0))","v":"Z"},{"$f":"IF(ISERROR(VLOOKUP(D124,Namen!A:D,4,0)),\"Z\",VLOOKUP(D124,Namen!A:D,4,0))","v":"Z"},{"$f":"IF(R124=\"ja\",$A$1,0)","v":0},null,null,null,null,"","","","",""]
[{"$f":"IF(ISERROR(RANK(B125,$B$4:$B$203,0)),\"\",RANK(B125,$B$4:$B$203,0))","v":""},{"$f":"IF(COUNT(F125:I125)=1,SUM(F125:I125)-50,IF(COUNT(F125:I125)=2,SUM(F125:I125)-100,IF(COUNT(F125:I125)=3,SUM(F125:I125)-150,IF(COUNT(F125:I125)=4,SUM(F125:I125)-200,\"\"))))","v":""},{"$f":"IF(D125=\"\",\"\",L125)","v":""},null,{"$f":"IF(ISERROR(VLOOKUP(D125,Namen!A:B,2,0)),\"\",VLOOKUP(D125,Namen!A:B,2,0))","v":""},null,null,null,null,{"$f":"IF(D125=0,\"\",SUM(T125:W125))","v":""},{"$f":"IF(F125=0,\"\",MAX(F125:I125))","v":""},122,null,null,null,null,{"$f":"IF(ISERROR(VLOOKUP(D125,Namen!A:C,3,0)),\"Z\",VLOOKUP(D125,Namen!A:C,3,0))","v":"Z"},{"$f":"IF(ISERROR(VLOOKUP(D125,Namen!A:D,4,0)),\"Z\",VLOOKUP(D125,Namen!A:D,4,0))","v":"Z"},{"$f":"IF(R125=\"ja\",$A$1,0)","v":0},null,null,null,null,"","","","",""]
[{"$f":"IF(ISERROR(RANK(B126,$B$4:$B$203,0)),\"\",RANK(B126,$B$4:$B$203,0))","v":""},{"$f":"IF(COUNT(F126:I126)=1,SUM(F126:I126)-50,IF(COUNT(F126:I126)=2,SUM(F126:I126)-100,IF(COUNT(F126:I126)=3,SUM(F126:I126)-150,IF(COUNT(F126:I126)=4,SUM(F126:I126)-200,\"\"))))","v":""},{"$f":"IF(D126=\"\",\"\",L126)","v":""},null,{"$f":"IF(ISERROR(VLOOKUP(D126,Namen!A:B,2,0)),\"\",VLOOKUP(D126,Namen!A:B,2,0))","v":""},null,null,null,null,{"$f":"IF(D126=0,\"\",SUM(T126:W126))","v":""},{"$f":"IF(F126=0,\"\",MAX(F126:I126))","v":""},123,null,null,null,null,{"$f":"IF(ISERROR(VLOOKUP(D126,Namen!A:C,3,0)),\"Z\",VLOOKUP(D126,Namen!A:C,3,0))","v":"Z"},{"$f":"IF(ISERROR(VLOOKUP(D126,Namen!A:D,4,0)),\"Z\",VLOOKUP(D126,Namen!A:D,4,0))","v":"Z"},{"$f":"IF(R126=\"ja\",$A$1,0)","v":0},null,null,null,null,"","","","",""]
[{"$f":"IF(ISERROR(RANK(B127,$B$4:$B$203,0)),\"\",RANK(B127,$B$4:$B$203,0))","v":""},{"$f":"IF(COUNT(F127:I127)=1,SUM(F127:I127)-50,IF(COUNT(F127:I127)=2,SUM(F127:I127)-100,IF(COUNT(F127:I127)=3,SUM(F127:I127)-150,IF(COUNT(F127:I127)=4,SUM(F127:I127)-200,\"\"))))","v":""},{"$f":"IF(D127=\"\",\"\",L127)","v":""},null,{"$f":"IF(ISERROR(VLOOKUP(D127,Namen!A:B,2,0)),\"\",VLOOKUP(D127,Namen!A:B,2,0))","v":""},null,null,null,null,{"$f":"IF(D127=0,\"\",SUM(T127:W127))","v":""},{"$f":"IF(F127=0,\"\",MAX(F127:I127))","v":""},124,null,null,null,null,{"$f":"IF(ISERROR(VLOOKUP(D127,Namen!A:C,3,0)),\"Z\",VLOOKUP(D127,Namen!A:C,3,0))","v":"Z"},{"$f":"IF(ISERROR(VLOOKUP(D127,Namen!A:D,4,0)),\"Z\",VLOOKUP(D127,Namen!A:D,4,0))","v":"Z"},{"$f":"IF(R127=\"ja\",$A$1,0)","v":0},null,null,null,null,"","","","",""]
[{"$f":"IF(ISERROR(RANK(B128,$B$4:$B$203,0)),\"\",RANK(B128,$B$4:$B$203,0))","v":""},{"$f":"IF(COUNT(F128:I128)=1,SUM(F128:I128)-50,IF(COUNT(F128:I128)=2,SUM(F128:I128)-100,IF(COUNT(F128:I128)=3,SUM(F128:I128)-150,IF(COUNT(F128:I128)=4,SUM(F128:I128)-200,\"\"))))","v":""},{"$f":"IF(D128=\"\",\"\",L128)","v":""},null,{"$f":"IF(ISERROR(VLOOKUP(D128,Namen!A:B,2,0)),\"\",VLOOKUP(D128,Namen!A:B,2,0))","v":""},null,null,null,null,{"$f":"IF(D128=0,\"\",SUM(T128:W128))","v":""},{"$f":"IF(F128=0,\"\",MAX(F128:I128))","v":""},125,null,null,null,null,{"$f":"IF(ISERROR(VLOOKUP(D128,Namen!A:C,3,0)),\"Z\",VLOOKUP(D128,Namen!A:C,3,0))","v":"Z"},{"$f":"IF(ISERROR(VLOOKUP(D128,Namen!A:D,4,0)),\"Z\",VLOOKUP(D128,Namen!A:D,4,0))","v":"Z"},{"$f":"IF(R128=\"ja\",$A$1,0)","v":0},null,null,null,null,"","","","",""]
[{"$f":"IF(ISERROR(RANK(B129,$B$4:$B$203,0)),\"\",RANK(B129,$B$4:$B$203,0))","v":""},{"$f":"IF(COUNT(F129:I129)=1,SUM(F129:I129)-50,IF(COUNT(F129:I129)=2,SUM(F129:I129)-100,IF(COUNT(F129:I129)=3,SUM(F129:I129)-150,IF(COUNT(F129:I129)=4,SUM(F129:I129)-200,\"\"))))","v":""},{"$f":"IF(D129=\"\",\"\",L129)","v":""},null,{"$f":"IF(ISERROR(VLOOKUP(D129,Namen!A:B,2,0)),\"\",VLOOKUP(D129,Namen!A:B,2,0))","v":""},null,null,null,null,{"$f":"IF(D129=0,\"\",SUM(T129:W129))","v":""},{"$f":"IF(F129=0,\"\",MAX(F129:I129))","v":""},126,null,null,null,null,{"$f":"IF(ISERROR(VLOOKUP(D129,Namen!A:C,3,0)),\"Z\",VLOOKUP(D129,Namen!A:C,3,0))","v":"Z"},{"$f":"IF(ISERROR(VLOOKUP(D129,Namen!A:D,4,0)),\"Z\",VLOOKUP(D129,Namen!A:D,4,0))","v":"Z"},{"$f":"IF(R129=\"ja\",$A$1,0)","v":0},null,null,null,null,"","","","",""]
[{"$f":"IF(ISERROR(RANK(B130,$B$4:$B$203,0)),\"\",RANK(B130,$B$4:$B$203,0))","v":""},{"$f":"IF(COUNT(F130:I130)=1,SUM(F130:I130)-50,IF(COUNT(F130:I130)=2,SUM(F130:I130)-100,IF(COUNT(F130:I130)=3,SUM(F130:I130)-150,IF(COUNT(F130:I130)=4,SUM(F130:I130)-200,\"\"))))","v":""},{"$f":"IF(D130=\"\",\"\",L130)","v":""},null,{"$f":"IF(ISERROR(VLOOKUP(D130,Namen!A:B,2,0)),\"\",VLOOKUP(D130,Namen!A:B,2,0))","v":""},null,null,null,null,{"$f":"IF(D130=0,\"\",SUM(T130:W130))","v":""},{"$f":"IF(F130=0,\"\",MAX(F130:I130))","v":""},127,null,null,null,null,{"$f":"IF(ISERROR(VLOOKUP(D130,Namen!A:C,3,0)),\"Z\",VLOOKUP(D130,Namen!A:C,3,0))","v":"Z"},{"$f":"IF(ISERROR(VLOOKUP(D130,Namen!A:D,4,0)),\"Z\",VLOOKUP(D130,Namen!A:D,4,0))","v":"Z"},{"$f":"IF(R130=\"ja\",$A$1,0)","v":0},null,null,null,null,"","","","",""]
[{"$f":"IF(ISERROR(RANK(B131,$B$4:$B$203,0)),\"\",RANK(B131,$B$4:$B$203,0))","v":""},{"$f":"IF(COUNT(F131:I131)=1,SUM(F131:I131)-50,IF(COUNT(F131:I131)=2,SUM(F131:I131)-100,IF(COUNT(F131:I131)=3,SUM(F131:I131)-150,IF(COUNT(F131:I131)=4,SUM(F131:I131)-200,\"\"))))","v":""},{"$f":"IF(D131=\"\",\"\",L131)","v":""},null,{"$f":"IF(ISERROR(VLOOKUP(D131,Namen!A:B,2,0)),\"\",VLOOKUP(D131,Namen!A:B,2,0))","v":""},null,null,null,null,{"$f":"IF(D131=0,\"\",SUM(T131:W131))","v":""},{"$f":"IF(F131=0,\"\",MAX(F131:I131))","v":""},128,null,null,null,null,{"$f":"IF(ISERROR(VLOOKUP(D131,Namen!A:C,3,0)),\"Z\",VLOOKUP(D131,Namen!A:C,3,0))","v":"Z"},{"$f":"IF(ISERROR(VLOOKUP(D131,Namen!A:D,4,0)),\"Z\",VLOOKUP(D131,Namen!A:D,4,0))","v":"Z"},{"$f":"IF(R131=\"ja\",$A$1,0)","v":0},null,null,null,null,"","","","",""]
[{"$f":"IF(ISERROR(RANK(B132,$B$4:$B$203,0)),\"\",RANK(B132,$B$4:$B$203,0))","v":""},{"$f":"IF(COUNT(F132:I132)=1,SUM(F132:I132)-50,IF(COUNT(F132:I132)=2,SUM(F132:I132)-100,IF(COUNT(F132:I132)=3,SUM(F132:I132)-150,IF(COUNT(F132:I132)=4,SUM(F132:I132)-200,\"\"))))","v":""},{"$f":"IF(D132=\"\",\"\",L132)","v":""},null,{"$f":"IF(ISERROR(VLOOKUP(D132,Namen!A:B,2,0)),\"\",VLOOKUP(D132,Namen!A:B,2,0))","v":""},null,null,null,null,{"$f":"IF(D132=0,\"\",SUM(T132:W132))","v":""},{"$f":"IF(F132=0,\"\",MAX(F132:I132))","v":""},129,null,null,null,null,{"$f":"IF(ISERROR(VLOOKUP(D132,Namen!A:C,3,0)),\"Z\",VLOOKUP(D132,Namen!A:C,3,0))","v":"Z"},{"$f":"IF(ISERROR(VLOOKUP(D132,Namen!A:D,4,0)),\"Z\",VLOOKUP(D132,Namen!A:D,4,0))","v":"Z"},{"$f":"IF(R132=\"ja\",$A$1,0)","v":0},null,null,null,null,"","","","",""]
[{"$f":"IF(ISERROR(RANK(B133,$B$4:$B$203,0)),\"\",RANK(B133,$B$4:$B$203,0))","v":""},{"$f":"IF(COUNT(F133:I133)=1,SUM(F133:I133)-50,IF(COUNT(F133:I133)=2,SUM(F133:I133)-100,IF(COUNT(F133:I133)=3,SUM(F133:I133)-150,IF(COUNT(F133:I133)=4,SUM(F133:I133)-200,\"\"))))","v":""},{"$f":"IF(D133=\"\",\"\",L133)","v":""},null,{"$f":"IF(ISERROR(VLOOKUP(D133,Namen!A:B,2,0)),\"\",VLOOKUP(D133,Namen!A:B,2,0))","v":""},null,null,null,null,{"$f":"IF(D133=0,\"\",SUM(T133:W133))","v":""},{"$f":"IF(F133=0,\"\",MAX(F133:I133))","v":""},130,null,null,null,null,{"$f":"IF(ISERROR(VLOOKUP(D133,Namen!A:C,3,0)),\"Z\",VLOOKUP(D133,Namen!A:C,3,0))","v":"Z"},{"$f":"IF(ISERROR(VLOOKUP(D133,Namen!A:D,4,0)),\"Z\",VLOOKUP(D133,Namen!A:D,4,0))","v":"Z"},{"$f":"IF(R133=\"ja\",$A$1,0)","v":0},null,null,null,null,"",{"$f":"IF(ISERROR(RANK(AA133,$AA$4:$AA$203,0)),\"\",RANK(AA133,$AA$4:$AA$203,0))","v":""},{"$f":"IFERROR(LARGE(F133:I133,2),\"\")","v":""},{"$f":"IFERROR(LARGE(F133:I133,3),\"\")","v":""},{"$f":"IFERROR(LARGE(F133:I133,4),\"\")","v":""}]
[{"$f":"IF(ISERROR(RANK(B134,$B$4:$B$203,0)),\"\",RANK(B134,$B$4:$B$203,0))","v":""},{"$f":"IF(COUNT(F134:I134)=1,SUM(F134:I134)-50,IF(COUNT(F134:I134)=2,SUM(F134:I134)-100,IF(COUNT(F134:I134)=3,SUM(F134:I134)-150,IF(COUNT(F134:I134)=4,SUM(F134:I134)-200,\"\"))))","v":""},{"$f":"IF(D134=\"\",\"\",L134)","v":""},null,{"$f":"IF(ISERROR(VLOOKUP(D134,Namen!A:B,2,0)),\"\",VLOOKUP(D134,Namen!A:B,2,0))","v":""},null,null,null,null,{"$f":"IF(D134=0,\"\",SUM(T134:W134))","v":""},{"$f":"IF(F134=0,\"\",MAX(F134:I134))","v":""},131,null,null,null,null,{"$f":"IF(ISERROR(VLOOKUP(D134,Namen!A:C,3,0)),\"Z\",VLOOKUP(D134,Namen!A:C,3,0))","v":"Z"},{"$f":"IF(ISERROR(VLOOKUP(D134,Namen!A:D,4,0)),\"Z\",VLOOKUP(D134,Namen!A:D,4,0))","v":"Z"},{"$f":"IF(R134=\"ja\",$A$1,0)","v":0},null,null,null,null,"","","","",""]
[{"$f":"IF(ISERROR(RANK(B135,$B$4:$B$203,0)),\"\",RANK(B135,$B$4:$B$203,0))","v":""},{"$f":"IF(COUNT(F135:I135)=1,SUM(F135:I135)-50,IF(COUNT(F135:I135)=2,SUM(F135:I135)-100,IF(COUNT(F135:I135)=3,SUM(F135:I135)-150,IF(COUNT(F135:I135)=4,SUM(F135:I135)-200,\"\"))))","v":""},{"$f":"IF(D135=\"\",\"\",L135)","v":""},null,{"$f":"IF(ISERROR(VLOOKUP(D135,Namen!A:B,2,0)),\"\",VLOOKUP(D135,Namen!A:B,2,0))","v":""},null,null,null,null,{"$f":"IF(D135=0,\"\",SUM(T135:W135))","v":""},{"$f":"IF(F135=0,\"\",MAX(F135:I135))","v":""},132,null,null,null,null,{"$f":"IF(ISERROR(VLOOKUP(D135,Namen!A:C,3,0)),\"Z\",VLOOKUP(D135,Namen!A:C,3,0))","v":"Z"},{"$f":"IF(ISERROR(VLOOKUP(D135,Namen!A:D,4,0)),\"Z\",VLOOKUP(D135,Namen!A:D,4,0))","v":"Z"},{"$f":"IF(R135=\"ja\",$A$1,0)","v":0},null,null,null,null,"","","","",""]
[{"$f":"IF(ISERROR(RANK(B136,$B$4:$B$203,0)),\"\",RANK(B136,$B$4:$B$203,0))","v":""},{"$f":"IF(COUNT(F136:I136)=1,SUM(F136:I136)-50,IF(COUNT(F136:I136)=2,SUM(F136:I136)-100,IF(COUNT(F136:I136)=3,SUM(F136:I136)-150,IF(COUNT(F136:I136)=4,SUM(F136:I136)-200,\"\"))))","v":""},{"$f":"IF(D136=\"\",\"\",L136)","v":""},null,{"$f":"IF(ISERROR(VLOOKUP(D136,Namen!A:B,2,0)),\"\",VLOOKUP(D136,Namen!A:B,2,0))","v":""},null,null,null,null,{"$f":"IF(D136=0,\"\",SUM(T136:W136))","v":""},{"$f":"IF(F136=0,\"\",MAX(F136:I136))","v":""},133,null,null,null,null,{"$f":"IF(ISERROR(VLOOKUP(D136,Namen!A:C,3,0)),\"Z\",VLOOKUP(D136,Namen!A:C,3,0))","v":"Z"},{"$f":"IF(ISERROR(VLOOKUP(D136,Namen!A:D,4,0)),\"Z\",VLOOKUP(D136,Namen!A:D,4,0))","v":"Z"},{"$f":"IF(R136=\"ja\",$A$1,0)","v":0},null,null,null,null,"","","","",""]
[{"$f":"IF(ISERROR(RANK(B137,$B$4:$B$203,0)),\"\",RANK(B137,$B$4:$B$203,0))","v":""},{"$f":"IF(COUNT(F137:I137)=1,SUM(F137:I137)-50,IF(COUNT(F137:I137)=2,SUM(F137:I137)-100,IF(COUNT(F137:I137)=3,SUM(F137:I137)-150,IF(COUNT(F137:I137)=4,SUM(F137:I137)-200,\"\"))))","v":""},{"$f":"IF(D137=\"\",\"\",L137)","v":""},null,{"$f":"IF(ISERROR(VLOOKUP(D137,Namen!A:B,2,0)),\"\",VLOOKUP(D137,Namen!A:B,2,0))","v":""},null,null,null,null,{"$f":"IF(D137=0,\"\",SUM(T137:W137))","v":""},{"$f":"IF(F137=0,\"\",MAX(F137:I137))","v":""},134,null,null,null,null,{"$f":"IF(ISERROR(VLOOKUP(D137,Namen!A:C,3,0)),\"Z\",VLOOKUP(D137,Namen!A:C,3,0))","v":"Z"},{"$f":"IF(ISERROR(VLOOKUP(D137,Namen!A:D,4,0)),\"Z\",VLOOKUP(D137,Namen!A:D,4,0))","v":"Z"},{"$f":"IF(R137=\"ja\",$A$1,0)","v":0},null,null,null,null,"","","","",""]
[{"$f":"IF(ISERROR(RANK(B138,$B$4:$B$203,0)),\"\",RANK(B138,$B$4:$B$203,0))","v":""},{"$f":"IF(COUNT(F138:I138)=1,SUM(F138:I138)-50,IF(COUNT(F138:I138)=2,SUM(F138:I138)-100,IF(COUNT(F138:I138)=3,SUM(F138:I138)-150,IF(COUNT(F138:I138)=4,SUM(F138:I138)-200,\"\"))))","v":""},{"$f":"IF(D138=\"\",\"\",L138)","v":""},null,{"$f":"IF(ISERROR(VLOOKUP(D138,Namen!A:B,2,0)),\"\",VLOOKUP(D138,Namen!A:B,2,0))","v":""},null,null,null,null,{"$f":"IF(D138=0,\"\",SUM(T138:W138))","v":""},{"$f":"IF(F138=0,\"\",MAX(F138:I138))","v":""},135,null,null,null,null,{"$f":"IF(ISERROR(VLOOKUP(D138,Namen!A:C,3,0)),\"Z\",VLOOKUP(D138,Namen!A:C,3,0))","v":"Z"},{"$f":"IF(ISERROR(VLOOKUP(D138,Namen!A:D,4,0)),\"Z\",VLOOKUP(D138,Namen!A:D,4,0))","v":"Z"},{"$f":"IF(R138=\"ja\",$A$1,0)","v":0},null,null,null,null,"","","","",""]
[{"$f":"IF(ISERROR(RANK(B139,$B$4:$B$203,0)),\"\",RANK(B139,$B$4:$B$203,0))","v":""},{"$f":"IF(COUNT(F139:I139)=1,SUM(F139:I139)-50,IF(COUNT(F139:I139)=2,SUM(F139:I139)-100,IF(COUNT(F139:I139)=3,SUM(F139:I139)-150,IF(COUNT(F139:I139)=4,SUM(F139:I139)-200,\"\"))))","v":""},{"$f":"IF(D139=\"\",\"\",L139)","v":""},null,{"$f":"IF(ISERROR(VLOOKUP(D139,Namen!A:B,2,0)),\"\",VLOOKUP(D139,Namen!A:B,2,0))","v":""},null,null,null,null,{"$f":"IF(D139=0,\"\",SUM(T139:W139))","v":""},{"$f":"IF(F139=0,\"\",MAX(F139:I139))","v":""},136,null,null,null,null,{"$f":"IF(ISERROR(VLOOKUP(D139,Namen!A:C,3,0)),\"Z\",VLOOKUP(D139,Namen!A:C,3,0))","v":"Z"},{"$f":"IF(ISERROR(VLOOKUP(D139,Namen!A:D,4,0)),\"Z\",VLOOKUP(D139,Namen!A:D,4,0))","v":"Z"},{"$f":"IF(R139=\"ja\",$A$1,0)","v":0},null,null,null,null,"","","","",""]
[{"$f":"IF(ISERROR(RANK(B140,$B$4:$B$203,0)),\"\",RANK(B140,$B$4:$B$203,0))","v":""},{"$f":"IF(COUNT(F140:I140)=1,SUM(F140:I140)-50,IF(COUNT(F140:I140)=2,SUM(F140:I140)-100,IF(COUNT(F140:I140)=3,SUM(F140:I140)-150,IF(COUNT(F140:I140)=4,SUM(F140:I140)-200,\"\"))))","v":""},{"$f":"IF(D140=\"\",\"\",L140)","v":""},null,{"$f":"IF(ISERROR(VLOOKUP(D140,Namen!A:B,2,0)),\"\",VLOOKUP(D140,Namen!A:B,2,0))","v":""},null,null,null,null,{"$f":"IF(D140=0,\"\",SUM(T140:W140))","v":""},{"$f":"IF(F140=0,\"\",MAX(F140:I140))","v":""},137,null,null,null,null,{"$f":"IF(ISERROR(VLOOKUP(D140,Namen!A:C,3,0)),\"Z\",VLOOKUP(D140,Namen!A:C,3,0))","v":"Z"},{"$f":"IF(ISERROR(VLOOKUP(D140,Namen!A:D,4,0)),\"Z\",VLOOKUP(D140,Namen!A:D,4,0))","v":"Z"},{"$f":"IF(R140=\"ja\",$A$1,0)","v":0},null,null,null,null,"","","","",""]
[{"$f":"IF(ISERROR(RANK(B141,$B$4:$B$203,0)),\"\",RANK(B141,$B$4:$B$203,0))","v":""},{"$f":"IF(COUNT(F141:I141)=1,SUM(F141:I141)-50,IF(COUNT(F141:I141)=2,SUM(F141:I141)-100,IF(COUNT(F141:I141)=3,SUM(F141:I141)-150,IF(COUNT(F141:I141)=4,SUM(F141:I141)-200,\"\"))))","v":""},{"$f":"IF(D141=\"\",\"\",L141)","v":""},null,{"$f":"IF(ISERROR(VLOOKUP(D141,Namen!A:B,2,0)),\"\",VLOOKUP(D141,Namen!A:B,2,0))","v":""},null,null,null,null,{"$f":"IF(D141=0,\"\",SUM(T141:W141))","v":""},{"$f":"IF(F141=0,\"\",MAX(F141:I141))","v":""},138,null,null,null,null,{"$f":"IF(ISERROR(VLOOKUP(D141,Namen!A:C,3,0)),\"Z\",VLOOKUP(D141,Namen!A:C,3,0))","v":"Z"},{"$f":"IF(ISERROR(VLOOKUP(D141,Namen!A:D,4,0)),\"Z\",VLOOKUP(D141,Namen!A:D,4,0))","v":"Z"},{"$f":"IF(R141=\"ja\",$A$1,0)","v":0},null,null,null,null,"","","","",""]
[{"$f":"IF(ISERROR(RANK(B142,$B$4:$B$203,0)),\"\",RANK(B142,$B$4:$B$203,0))","v":""},{"$f":"IF(COUNT(F142:I142)=1,SUM(F142:I142)-50,IF(COUNT(F142:I142)=2,SUM(F142:I142)-100,IF(COUNT(F142:I142)=3,SUM(F142:I142)-150,IF(COUNT(F142:I142)=4,SUM(F142:I142)-200,\"\"))))","v":""},{"$f":"IF(D142=\"\",\"\",L142)","v":""},null,{"$f":"IF(ISERROR(VLOOKUP(D142,Namen!A:B,2,0)),\"\",VLOOKUP(D142,Namen!A:B,2,0))","v":""},null,null,null,null,{"$f":"IF(D142=0,\"\",SUM(T142:W142))","v":""},{"$f":"IF(F142=0,\"\",MAX(F142:I142))","v":""},139,null,null,null,null,{"$f":"IF(ISERROR(VLOOKUP(D142,Namen!A:C,3,0)),\"Z\",VLOOKUP(D142,Namen!A:C,3,0))","v":"Z"},{"$f":"IF(ISERROR(VLOOKUP(D142,Namen!A:D,4,0)),\"Z\",VLOOKUP(D142,Namen!A:D,4,0))","v":"Z"},{"$f":"IF(R142=\"ja\",$A$1,0)","v":0},null,null,null,null,"","","","",""]
[{"$f":"IF(ISERROR(RANK(B143,$B$4:$B$203,0)),\"\",RANK(B143,$B$4:$B$203,0))","v":""},{"$f":"IF(COUNT(F143:I143)=1,SUM(F143:I143)-50,IF(COUNT(F143:I143)=2,SUM(F143:I143)-100,IF(COUNT(F143:I143)=3,SUM(F143:I143)-150,IF(COUNT(F143:I143)=4,SUM(F143:I143)-200,\"\"))))","v":""},{"$f":"IF(D143=\"\",\"\",L143)","v":""},null,{"$f":"IF(ISERROR(VLOOKUP(D143,Namen!A:B,2,0)),\"\",VLOOKUP(D143,Namen!A:B,2,0))","v":""},null,null,null,null,{"$f":"IF(D143=0,\"\",SUM(T143:W143))","v":""},{"$f":"IF(F143=0,\"\",MAX(F143:I143))","v":""},140,null,null,null,null,{"$f":"IF(ISERROR(VLOOKUP(D143,Namen!A:C,3,0)),\"Z\",VLOOKUP(D143,Namen!A:C,3,0))","v":"Z"},{"$f":"IF(ISERROR(VLOOKUP(D143,Namen!A:D,4,0)),\"Z\",VLOOKUP(D143,Namen!A:D,4,0))","v":"Z"},{"$f":"IF(R143=\"ja\",$A$1,0)","v":0},null,null,null,null,"","","","",""]
[{"$f":"IF(ISERROR(RANK(B144,$B$4:$B$203,0)),\"\",RANK(B144,$B$4:$B$203,0))","v":""},{"$f":"IF(COUNT(F144:I144)=1,SUM(F144:I144)-50,IF(COUNT(F144:I144)=2,SUM(F144:I144)-100,IF(COUNT(F144:I144)=3,SUM(F144:I144)-150,IF(COUNT(F144:I144)=4,SUM(F144:I144)-200,\"\"))))","v":""},{"$f":"IF(D144=\"\",\"\",L144)","v":""},null,{"$f":"IF(ISERROR(VLOOKUP(D144,Namen!A:B,2,0)),\"\",VLOOKUP(D144,Namen!A:B,2,0))","v":""},null,null,null,null,{"$f":"IF(D144=0,\"\",SUM(T144:W144))","v":""},{"$f":"IF(F144=0,\"\",MAX(F144:I144))","v":""},141,null,null,null,null,{"$f":"IF(ISERROR(VLOOKUP(D144,Namen!A:C,3,0)),\"Z\",VLOOKUP(D144,Namen!A:C,3,0))","v":"Z"},{"$f":"IF(ISERROR(VLOOKUP(D144,Namen!A:D,4,0)),\"Z\",VLOOKUP(D144,Namen!A:D,4,0))","v":"Z"},{"$f":"IF(R144=\"ja\",$A$1,0)","v":0},null,null,null,null,"","","","",""]
[{"$f":"IF(ISERROR(RANK(B145,$B$4:$B$203,0)),\"\",RANK(B145,$B$4:$B$203,0))","v":""},{"$f":"IF(COUNT(F145:I145)=1,SUM(F145:I145)-50,IF(COUNT(F145:I145)=2,SUM(F145:I145)-100,IF(COUNT(F145:I145)=3,SUM(F145:I145)-150,IF(COUNT(F145:I145)=4,SUM(F145:I145)-200,\"\"))))","v":""},{"$f":"IF(D145=\"\",\"\",L145)","v":""},null,{"$f":"IF(ISERROR(VLOOKUP(D145,Namen!A:B,2,0)),\"\",VLOOKUP(D145,Namen!A:B,2,0))","v":""},null,null,null,null,{"$f":"IF(D145=0,\"\",SUM(T145:W145))","v":""},{"$f":"IF(F145=0,\"\",MAX(F145:I145))","v":""},142,null,null,null,null,{"$f":"IF(ISERROR(VLOOKUP(D145,Namen!A:C,3,0)),\"Z\",VLOOKUP(D145,Namen!A:C,3,0))","v":"Z"},{"$f":"IF(ISERROR(VLOOKUP(D145,Namen!A:D,4,0)),\"Z\",VLOOKUP(D145,Namen!A:D,4,0))","v":"Z"},{"$f":"IF(R145=\"ja\",$A$1,0)","v":0},null,null,null,null,"","","","",""]
[{"$f":"IF(ISERROR(RANK(B146,$B$4:$B$203,0)),\"\",RANK(B146,$B$4:$B$203,0))","v":""},{"$f":"IF(COUNT(F146:I146)=1,SUM(F146:I146)-50,IF(COUNT(F146:I146)=2,SUM(F146:I146)-100,IF(COUNT(F146:I146)=3,SUM(F146:I146)-150,IF(COUNT(F146:I146)=4,SUM(F146:I146)-200,\"\"))))","v":""},{"$f":"IF(D146=\"\",\"\",L146)","v":""},null,{"$f":"IF(ISERROR(VLOOKUP(D146,Namen!A:B,2,0)),\"\",VLOOKUP(D146,Namen!A:B,2,0))","v":""},null,null,null,null,{"$f":"IF(D146=0,\"\",SUM(T146:W146))","v":""},{"$f":"IF(F146=0,\"\",MAX(F146:I146))","v":""},143,null,null,null,null,{"$f":"IF(ISERROR(VLOOKUP(D146,Namen!A:C,3,0)),\"Z\",VLOOKUP(D146,Namen!A:C,3,0))","v":"Z"},{"$f":"IF(ISERROR(VLOOKUP(D146,Namen!A:D,4,0)),\"Z\",VLOOKUP(D146,Namen!A:D,4,0))","v":"Z"},{"$f":"IF(R146=\"ja\",$A$1,0)","v":0},null,null,null,null,"","","","",""]
[{"$f":"IF(ISERROR(RANK(B147,$B$4:$B$203,0)),\"\",RANK(B147,$B$4:$B$203,0))","v":""},{"$f":"IF(COUNT(F147:I147)=1,SUM(F147:I147)-50,IF(COUNT(F147:I147)=2,SUM(F147:I147)-100,IF(COUNT(F147:I147)=3,SUM(F147:I147)-150,IF(COUNT(F147:I147)=4,SUM(F147:I147)-200,\"\"))))","v":""},{"$f":"IF(D147=\"\",\"\",L147)","v":""},null,{"$f":"IF(ISERROR(VLOOKUP(D147,Namen!A:B,2,0)),\"\",VLOOKUP(D147,Namen!A:B,2,0))","v":""},null,null,null,null,{"$f":"IF(D147=0,\"\",SUM(T147:W147))","v":""},{"$f":"IF(F147=0,\"\",MAX(F147:I147))","v":""},144,null,null,null,null,{"$f":"IF(ISERROR(VLOOKUP(D147,Namen!A:C,3,0)),\"Z\",VLOOKUP(D147,Namen!A:C,3,0))","v":"Z"},{"$f":"IF(ISERROR(VLOOKUP(D147,Namen!A:D,4,0)),\"Z\",VLOOKUP(D147,Namen!A:D,4,0))","v":"Z"},{"$f":"IF(R147=\"ja\",$A$1,0)","v":0},null,null,null,null,"","","","",""]
[{"$f":"IF(ISERROR(RANK(B148,$B$4:$B$203,0)),\"\",RANK(B148,$B$4:$B$203,0))","v":""},{"$f":"IF(COUNT(F148:I148)=1,SUM(F148:I148)-50,IF(COUNT(F148:I148)=2,SUM(F148:I148)-100,IF(COUNT(F148:I148)=3,SUM(F148:I148)-150,IF(COUNT(F148:I148)=4,SUM(F148:I148)-200,\"\"))))","v":""},{"$f":"IF(D148=\"\",\"\",L148)","v":""},null,{"$f":"IF(ISERROR(VLOOKUP(D148,Namen!A:B,2,0)),\"\",VLOOKUP(D148,Namen!A:B,2,0))","v":""},null,null,null,null,{"$f":"IF(D148=0,\"\",SUM(T148:W148))","v":""},{"$f":"IF(F148=0,\"\",MAX(F148:I148))","v":""},145,null,null,null,null,{"$f":"IF(ISERROR(VLOOKUP(D148,Namen!A:C,3,0)),\"Z\",VLOOKUP(D148,Namen!A:C,3,0))","v":"Z"},{"$f":"IF(ISERROR(VLOOKUP(D148,Namen!A:D,4,0)),\"Z\",VLOOKUP(D148,Namen!A:D,4,0))","v":"Z"},{"$f":"IF(R148=\"ja\",$A$1,0)","v":0},null,null,null,null,"","","","",""]
[{"$f":"IF(ISERROR(RANK(B149,$B$4:$B$203,0)),\"\",RANK(B149,$B$4:$B$203,0))","v":""},{"$f":"IF(COUNT(F149:I149)=1,SUM(F149:I149)-50,IF(COUNT(F149:I149)=2,SUM(F149:I149)-100,IF(COUNT(F149:I149)=3,SUM(F149:I149)-150,IF(COUNT(F149:I149)=4,SUM(F149:I149)-200,\"\"))))","v":""},{"$f":"IF(D149=\"\",\"\",L149)","v":""},null,{"$f":"IF(ISERROR(VLOOKUP(D149,Namen!A:B,2,0)),\"\",VLOOKUP(D149,Namen!A:B,2,0))","v":""},null,null,null,null,{"$f":"IF(D149=0,\"\",SUM(T149:W149))","v":""},{"$f":"IF(F149=0,\"\",MAX(F149:I149))","v":""},146,null,null,null,null,{"$f":"IF(ISERROR(VLOOKUP(D149,Namen!A:C,3,0)),\"Z\",VLOOKUP(D149,Namen!A:C,3,0))","v":"Z"},{"$f":"IF(ISERROR(VLOOKUP(D149,Namen!A:D,4,0)),\"Z\",VLOOKUP(D149,Namen!A:D,4,0))","v":"Z"},{"$f":"IF(R149=\"ja\",$A$1,0)","v":0},null,null,null,null,"","","","",""]
[{"$f":"IF(ISERROR(RANK(B150,$B$4:$B$203,0)),\"\",RANK(B150,$B$4:$B$203,0))","v":""},{"$f":"IF(COUNT(F150:I150)=1,SUM(F150:I150)-50,IF(COUNT(F150:I150)=2,SUM(F150:I150)-100,IF(COUNT(F150:I150)=3,SUM(F150:I150)-150,IF(COUNT(F150:I150)=4,SUM(F150:I150)-200,\"\"))))","v":""},{"$f":"IF(D150=\"\",\"\",L150)","v":""},null,{"$f":"IF(ISERROR(VLOOKUP(D150,Namen!A:B,2,0)),\"\",VLOOKUP(D150,Namen!A:B,2,0))","v":""},null,null,null,null,{"$f":"IF(D150=0,\"\",SUM(T150:W150))","v":""},{"$f":"IF(F150=0,\"\",MAX(F150:I150))","v":""},147,null,null,null,null,{"$f":"IF(ISERROR(VLOOKUP(D150,Namen!A:C,3,0)),\"Z\",VLOOKUP(D150,Namen!A:C,3,0))","v":"Z"},{"$f":"IF(ISERROR(VLOOKUP(D150,Namen!A:D,4,0)),\"Z\",VLOOKUP(D150,Namen!A:D,4,0))","v":"Z"},{"$f":"IF(R150=\"ja\",$A$1,0)","v":0},null,null,null,null,"","","","",""]
[{"$f":"IF(ISERROR(RANK(B151,$B$4:$B$203,0)),\"\",RANK(B151,$B$4:$B$203,0))","v":""},{"$f":"IF(COUNT(F151:I151)=1,SUM(F151:I151)-50,IF(COUNT(F151:I151)=2,SUM(F151:I151)-100,IF(COUNT(F151:I151)=3,SUM(F151:I151)-150,IF(COUNT(F151:I151)=4,SUM(F151:I151)-200,\"\"))))","v":""},{"$f":"IF(D151=\"\",\"\",L151)","v":""},null,{"$f":"IF(ISERROR(VLOOKUP(D151,Namen!A:B,2,0)),\"\",VLOOKUP(D151,Namen!A:B,2,0))","v":""},null,null,null,null,{"$f":"IF(D151=0,\"\",SUM(T151:W151))","v":""},{"$f":"IF(F151=0,\"\",MAX(F151:I151))","v":""},148,null,null,null,null,{"$f":"IF(ISERROR(VLOOKUP(D151,Namen!A:C,3,0)),\"Z\",VLOOKUP(D151,Namen!A:C,3,0))","v":"Z"},{"$f":"IF(ISERROR(VLOOKUP(D151,Namen!A:D,4,0)),\"Z\",VLOOKUP(D151,Namen!A:D,4,0))","v":"Z"},{"$f":"IF(R151=\"ja\",$A$1,0)","v":0},null,null,null,null,"","","","",""]
[{"$f":"IF(ISERROR(RANK(B152,$B$4:$B$203,0)),\"\",RANK(B152,$B$4:$B$203,0))","v":""},{"$f":"IF(COUNT(F152:I152)=1,SUM(F152:I152)-50,IF(COUNT(F152:I152)=2,SUM(F152:I152)-100,IF(COUNT(F152:I152)=3,SUM(F152:I152)-150,IF(COUNT(F152:I152)=4,SUM(F152:I152)-200,\"\"))))","v":""},{"$f":"IF(D152=\"\",\"\",L152)","v":""},null,{"$f":"IF(ISERROR(VLOOKUP(D152,Namen!A:B,2,0)),\"\",VLOOKUP(D152,Namen!A:B,2,0))","v":""},null,null,null,null,{"$f":"IF(D152=0,\"\",SUM(T152:W152))","v":""},{"$f":"IF(F152=0,\"\",MAX(F152:I152))","v":""},149,null,null,null,null,{"$f":"IF(ISERROR(VLOOKUP(D152,Namen!A:C,3,0)),\"Z\",VLOOKUP(D152,Namen!A:C,3,0))","v":"Z"},{"$f":"IF(ISERROR(VLOOKUP(D152,Namen!A:D,4,0)),\"Z\",VLOOKUP(D152,Namen!A:D,4,0))","v":"Z"},{"$f":"IF(R152=\"ja\",$A$1,0)","v":0},null,null,null,null,"","","","",""]
[{"$f":"IF(ISERROR(RANK(B153,$B$4:$B$203,0)),\"\",RANK(B153,$B$4:$B$203,0))","v":""},{"$f":"IF(COUNT(F153:I153)=1,SUM(F153:I153)-50,IF(COUNT(F153:I153)=2,SUM(F153:I153)-100,IF(COUNT(F153:I153)=3,SUM(F153:I153)-150,IF(COUNT(F153:I153)=4,SUM(F153:I153)-200,\"\"))))","v":""},{"$f":"IF(D153=\"\",\"\",L153)","v":""},null,{"$f":"IF(ISERROR(VLOOKUP(D153,Namen!A:B,2,0)),\"\",VLOOKUP(D153,Namen!A:B,2,0))","v":""},null,null,null,null,{"$f":"IF(D153=0,\"\",SUM(T153:W153))","v":""},{"$f":"IF(F153=0,\"\",MAX(F153:I153))","v":""},150,null,null,null,null,{"$f":"IF(ISERROR(VLOOKUP(D153,Namen!A:C,3,0)),\"Z\",VLOOKUP(D153,Namen!A:C,3,0))","v":"Z"},{"$f":"IF(ISERROR(VLOOKUP(D153,Namen!A:D,4,0)),\"Z\",VLOOKUP(D153,Namen!A:D,4,0))","v":"Z"},{"$f":"IF(R153=\"ja\",$A$1,0)","v":0},null,null,null,null,"","","","",""]
[{"$f":"IF(ISERROR(RANK(B154,$B$4:$B$203,0)),\"\",RANK(B154,$B$4:$B$203,0))","v":""},{"$f":"IF(COUNT(F154:I154)=1,SUM(F154:I154)-50,IF(COUNT(F154:I154)=2,SUM(F154:I154)-100,IF(COUNT(F154:I154)=3,SUM(F154:I154)-150,IF(COUNT(F154:I154)=4,SUM(F154:I154)-200,\"\"))))","v":""},{"$f":"IF(D154=\"\",\"\",L154)","v":""},null,{"$f":"IF(ISERROR(VLOOKUP(D154,Namen!A:B,2,0)),\"\",VLOOKUP(D154,Namen!A:B,2,0))","v":""},null,null,null,null,{"$f":"IF(D154=0,\"\",SUM(T154:W154))","v":""},{"$f":"IF(F154=0,\"\",MAX(F154:I154))","v":""},151,null,null,null,null,{"$f":"IF(ISERROR(VLOOKUP(D154,Namen!A:C,3,0)),\"Z\",VLOOKUP(D154,Namen!A:C,3,0))","v":"Z"},{"$f":"IF(ISERROR(VLOOKUP(D154,Namen!A:D,4,0)),\"Z\",VLOOKUP(D154,Namen!A:D,4,0))","v":"Z"},{"$f":"IF(R154=\"ja\",$A$1,0)","v":0},null,null,null,null,"","","","",""]
[{"$f":"IF(ISERROR(RANK(B155,$B$4:$B$203,0)),\"\",RANK(B155,$B$4:$B$203,0))","v":""},{"$f":"IF(COUNT(F155:I155)=1,SUM(F155:I155)-50,IF(COUNT(F155:I155)=2,SUM(F155:I155)-100,IF(COUNT(F155:I155)=3,SUM(F155:I155)-150,IF(COUNT(F155:I155)=4,SUM(F155:I155)-200,\"\"))))","v":""},{"$f":"IF(D155=\"\",\"\",L155)","v":""},null,{"$f":"IF(ISERROR(VLOOKUP(D155,Namen!A:B,2,0)),\"\",VLOOKUP(D155,Namen!A:B,2,0))","v":""},null,null,null,null,{"$f":"IF(D155=0,\"\",SUM(T155:W155))","v":""},{"$f":"IF(F155=0,\"\",MAX(F155:I155))","v":""},152,null,null,null,null,{"$f":"IF(ISERROR(VLOOKUP(D155,Namen!A:C,3,0)),\"Z\",VLOOKUP(D155,Namen!A:C,3,0))","v":"Z"},{"$f":"IF(ISERROR(VLOOKUP(D155,Namen!A:D,4,0)),\"Z\",VLOOKUP(D155,Namen!A:D,4,0))","v":"Z"},{"$f":"IF(R155=\"ja\",$A$1,0)","v":0},null,null,null,null,"","","","",""]
[{"$f":"IF(ISERROR(RANK(B156,$B$4:$B$203,0)),\"\",RANK(B156,$B$4:$B$203,0))","v":""},{"$f":"IF(COUNT(F156:I156)=1,SUM(F156:I156)-50,IF(COUNT(F156:I156)=2,SUM(F156:I156)-100,IF(COUNT(F156:I156)=3,SUM(F156:I156)-150,IF(COUNT(F156:I156)=4,SUM(F156:I156)-200,\"\"))))","v":""},{"$f":"IF(D156=\"\",\"\",L156)","v":""},null,{"$f":"IF(ISERROR(VLOOKUP(D156,Namen!A:B,2,0)),\"\",VLOOKUP(D156,Namen!A:B,2,0))","v":""},null,null,null,null,{"$f":"IF(D156=0,\"\",SUM(T156:W156))","v":""},{"$f":"IF(F156=0,\"\",MAX(F156:I156))","v":""},153,null,null,null,null,{"$f":"IF(ISERROR(VLOOKUP(D156,Namen!A:C,3,0)),\"Z\",VLOOKUP(D156,Namen!A:C,3,0))","v":"Z"},{"$f":"IF(ISERROR(VLOOKUP(D156,Namen!A:D,4,0)),\"Z\",VLOOKUP(D156,Namen!A:D,4,0))","v":"Z"},{"$f":"IF(R156=\"ja\",$A$1,0)","v":0},null,null,null,null,"","","","",""]
[{"$f":"IF(ISERROR(RANK(B157,$B$4:$B$203,0)),\"\",RANK(B157,$B$4:$B$203,0))","v":""},{"$f":"IF(COUNT(F157:I157)=1,SUM(F157:I157)-50,IF(COUNT(F157:I157)=2,SUM(F157:I157)-100,IF(COUNT(F157:I157)=3,SUM(F157:I157)-150,IF(COUNT(F157:I157)=4,SUM(F157:I157)-200,\"\"))))","v":""},{"$f":"IF(D157=\"\",\"\",L157)","v":""},null,{"$f":"IF(ISERROR(VLOOKUP(D157,Namen!A:B,2,0)),\"\",VLOOKUP(D157,Namen!A:B,2,0))","v":""},null,null,null,null,{"$f":"IF(D157=0,\"\",SUM(T157:W157))","v":""},{"$f":"IF(F157=0,\"\",MAX(F157:I157))","v":""},154,null,null,null,null,{"$f":"IF(ISERROR(VLOOKUP(D157,Namen!A:C,3,0)),\"Z\",VLOOKUP(D157,Namen!A:C,3,0))","v":"Z"},{"$f":"IF(ISERROR(VLOOKUP(D157,Namen!A:D,4,0)),\"Z\",VLOOKUP(D157,Namen!A:D,4,0))","v":"Z"},{"$f":"IF(R157=\"ja\",$A$1,0)","v":0},null,null,null,null,"","","","",""]
[{"$f":"IF(ISERROR(RANK(B158,$B$4:$B$203,0)),\"\",RANK(B158,$B$4:$B$203,0))","v":""},{"$f":"IF(COUNT(F158:I158)=1,SUM(F158:I158)-50,IF(COUNT(F158:I158)=2,SUM(F158:I158)-100,IF(COUNT(F158:I158)=3,SUM(F158:I158)-150,IF(COUNT(F158:I158)=4,SUM(F158:I158)-200,\"\"))))","v":""},{"$f":"IF(D158=\"\",\"\",L158)","v":""},null,{"$f":"IF(ISERROR(VLOOKUP(D158,Namen!A:B,2,0)),\"\",VLOOKUP(D158,Namen!A:B,2,0))","v":""},null,null,null,null,{"$f":"IF(D158=0,\"\",SUM(T158:W158))","v":""},{"$f":"IF(F158=0,\"\",MAX(F158:I158))","v":""},155,null,null,null,null,{"$f":"IF(ISERROR(VLOOKUP(D158,Namen!A:C,3,0)),\"Z\",VLOOKUP(D158,Namen!A:C,3,0))","v":"Z"},{"$f":"IF(ISERROR(VLOOKUP(D158,Namen!A:D,4,0)),\"Z\",VLOOKUP(D158,Namen!A:D,4,0))","v":"Z"},{"$f":"IF(R158=\"ja\",$A$1,0)","v":0},null,null,null,null,"","","","",""]
[{"$f":"IF(ISERROR(RANK(B159,$B$4:$B$203,0)),\"\",RANK(B159,$B$4:$B$203,0))","v":""},{"$f":"IF(COUNT(F159:I159)=1,SUM(F159:I159)-50,IF(COUNT(F159:I159)=2,SUM(F159:I159)-100,IF(COUNT(F159:I159)=3,SUM(F159:I159)-150,IF(COUNT(F159:I159)=4,SUM(F159:I159)-200,\"\"))))","v":""},{"$f":"IF(D159=\"\",\"\",L159)","v":""},null,{"$f":"IF(ISERROR(VLOOKUP(D159,Namen!A:B,2,0)),\"\",VLOOKUP(D159,Namen!A:B,2,0))","v":""},null,null,null,null,{"$f":"IF(D159=0,\"\",SUM(T159:W159))","v":""},{"$f":"IF(F159=0,\"\",MAX(F159:I159))","v":""},156,null,null,null,null,{"$f":"IF(ISERROR(VLOOKUP(D159,Namen!A:C,3,0)),\"Z\",VLOOKUP(D159,Namen!A:C,3,0))","v":"Z"},{"$f":"IF(ISERROR(VLOOKUP(D159,Namen!A:D,4,0)),\"Z\",VLOOKUP(D159,Namen!A:D,4,0))","v":"Z"},{"$f":"IF(R159=\"ja\",$A$1,0)","v":0},null,null,null,null,"","","","",""]
[{"$f":"IF(ISERROR(RANK(B160,$B$4:$B$203,0)),\"\",RANK(B160,$B$4:$B$203,0))","v":""},{"$f":"IF(COUNT(F160:I160)=1,SUM(F160:I160)-50,IF(COUNT(F160:I160)=2,SUM(F160:I160)-100,IF(COUNT(F160:I160)=3,SUM(F160:I160)-150,IF(COUNT(F160:I160)=4,SUM(F160:I160)-200,\"\"))))","v":""},{"$f":"IF(D160=\"\",\"\",L160)","v":""},null,{"$f":"IF(ISERROR(VLOOKUP(D160,Namen!A:B,2,0)),\"\",VLOOKUP(D160,Namen!A:B,2,0))","v":""},null,null,null,null,{"$f":"IF(D160=0,\"\",SUM(T160:W160))","v":""},{"$f":"IF(F160=0,\"\",MAX(F160:I160))","v":""},157,null,null,null,null,{"$f":"IF(ISERROR(VLOOKUP(D160,Namen!A:C,3,0)),\"Z\",VLOOKUP(D160,Namen!A:C,3,0))","v":"Z"},{"$f":"IF(ISERROR(VLOOKUP(D160,Namen!A:D,4,0)),\"Z\",VLOOKUP(D160,Namen!A:D,4,0))","v":"Z"},{"$f":"IF(R160=\"ja\",$A$1,0)","v":0},null,null,null,null,"","","","",""]
[{"$f":"IF(ISERROR(RANK(B161,$B$4:$B$203,0)),\"\",RANK(B161,$B$4:$B$203,0))","v":""},{"$f":"IF(COUNT(F161:I161)=1,SUM(F161:I161)-50,IF(COUNT(F161:I161)=2,SUM(F161:I161)-100,IF(COUNT(F161:I161)=3,SUM(F161:I161)-150,IF(COUNT(F161:I161)=4,SUM(F161:I161)-200,\"\"))))","v":""},{"$f":"IF(D161=\"\",\"\",L161)","v":""},null,{"$f":"IF(ISERROR(VLOOKUP(D161,Namen!A:B,2,0)),\"\",VLOOKUP(D161,Namen!A:B,2,0))","v":""},null,null,null,null,{"$f":"IF(D161=0,\"\",SUM(T161:W161))","v":""},{"$f":"IF(F161=0,\"\",MAX(F161:I161))","v":""},158,null,null,null,null,{"$f":"IF(ISERROR(VLOOKUP(D161,Namen!A:C,3,0)),\"Z\",VLOOKUP(D161,Namen!A:C,3,0))","v":"Z"},{"$f":"IF(ISERROR(VLOOKUP(D161,Namen!A:D,4,0)),\"Z\",VLOOKUP(D161,Namen!A:D,4,0))","v":"Z"},{"$f":"IF(R161=\"ja\",$A$1,0)","v":0},null,null,null,null,"","","","",""]
[{"$f":"IF(ISERROR(RANK(B162,$B$4:$B$203,0)),\"\",RANK(B162,$B$4:$B$203,0))","v":""},{"$f":"IF(COUNT(F162:I162)=1,SUM(F162:I162)-50,IF(COUNT(F162:I162)=2,SUM(F162:I162)-100,IF(COUNT(F162:I162)=3,SUM(F162:I162)-150,IF(COUNT(F162:I162)=4,SUM(F162:I162)-200,\"\"))))","v":""},{"$f":"IF(D162=\"\",\"\",L162)","v":""},null,{"$f":"IF(ISERROR(VLOOKUP(D162,Namen!A:B,2,0)),\"\",VLOOKUP(D162,Namen!A:B,2,0))","v":""},null,null,null,null,{"$f":"IF(D162=0,\"\",SUM(T162:W162))","v":""},{"$f":"IF(F162=0,\"\",MAX(F162:I162))","v":""},159,null,null,null,null,{"$f":"IF(ISERROR(VLOOKUP(D162,Namen!A:C,3,0)),\"Z\",VLOOKUP(D162,Namen!A:C,3,0))","v":"Z"},{"$f":"IF(ISERROR(VLOOKUP(D162,Namen!A:D,4,0)),\"Z\",VLOOKUP(D162,Namen!A:D,4,0))","v":"Z"},{"$f":"IF(R162=\"ja\",$A$1,0)","v":0},null,null,null,null,"","","","",""]
[{"$f":"IF(ISERROR(RANK(B163,$B$4:$B$203,0)),\"\",RANK(B163,$B$4:$B$203,0))","v":""},{"$f":"IF(COUNT(F163:I163)=1,SUM(F163:I163)-50,IF(COUNT(F163:I163)=2,SUM(F163:I163)-100,IF(COUNT(F163:I163)=3,SUM(F163:I163)-150,IF(COUNT(F163:I163)=4,SUM(F163:I163)-200,\"\"))))","v":""},{"$f":"IF(D163=\"\",\"\",L163)","v":""},null,{"$f":"IF(ISERROR(VLOOKUP(D163,Namen!A:B,2,0)),\"\",VLOOKUP(D163,Namen!A:B,2,0))","v":""},null,null,null,null,{"$f":"IF(D163=0,\"\",SUM(T163:W163))","v":""},{"$f":"IF(F163=0,\"\",MAX(F163:I163))","v":""},160,null,null,null,null,{"$f":"IF(ISERROR(VLOOKUP(D163,Namen!A:C,3,0)),\"Z\",VLOOKUP(D163,Namen!A:C,3,0))","v":"Z"},{"$f":"IF(ISERROR(VLOOKUP(D163,Namen!A:D,4,0)),\"Z\",VLOOKUP(D163,Namen!A:D,4,0))","v":"Z"},{"$f":"IF(R163=\"ja\",$A$1,0)","v":0},null,null,null,null,"","","","",""]
[{"$f":"IF(ISERROR(RANK(B164,$B$4:$B$203,0)),\"\",RANK(B164,$B$4:$B$203,0))","v":""},{"$f":"IF(COUNT(F164:I164)=1,SUM(F164:I164)-50,IF(COUNT(F164:I164)=2,SUM(F164:I164)-100,IF(COUNT(F164:I164)=3,SUM(F164:I164)-150,IF(COUNT(F164:I164)=4,SUM(F164:I164)-200,\"\"))))","v":""},{"$f":"IF(D164=\"\",\"\",L164)","v":""},null,{"$f":"IF(ISERROR(VLOOKUP(D164,Namen!A:B,2,0)),\"\",VLOOKUP(D164,Namen!A:B,2,0))","v":""},null,null,null,null,{"$f":"IF(D164=0,\"\",SUM(T164:W164))","v":""},{"$f":"IF(F164=0,\"\",MAX(F164:I164))","v":""},161,null,null,null,null,{"$f":"IF(ISERROR(VLOOKUP(D164,Namen!A:C,3,0)),\"Z\",VLOOKUP(D164,Namen!A:C,3,0))","v":"Z"},{"$f":"IF(ISERROR(VLOOKUP(D164,Namen!A:D,4,0)),\"Z\",VLOOKUP(D164,Namen!A:D,4,0))","v":"Z"},{"$f":"IF(R164=\"ja\",$A$1,0)","v":0},null,null,null,null,"","","","",""]
[{"$f":"IF(ISERROR(RANK(B165,$B$4:$B$203,0)),\"\",RANK(B165,$B$4:$B$203,0))","v":""},{"$f":"IF(COUNT(F165:I165)=1,SUM(F165:I165)-50,IF(COUNT(F165:I165)=2,SUM(F165:I165)-100,IF(COUNT(F165:I165)=3,SUM(F165:I165)-150,IF(COUNT(F165:I165)=4,SUM(F165:I165)-200,\"\"))))","v":""},{"$f":"IF(D165=\"\",\"\",L165)","v":""},null,{"$f":"IF(ISERROR(VLOOKUP(D165,Namen!A:B,2,0)),\"\",VLOOKUP(D165,Namen!A:B,2,0))","v":""},null,null,null,null,{"$f":"IF(D165=0,\"\",SUM(T165:W165))","v":""},{"$f":"IF(F165=0,\"\",MAX(F165:I165))","v":""},162,null,null,null,null,{"$f":"IF(ISERROR(VLOOKUP(D165,Namen!A:C,3,0)),\"Z\",VLOOKUP(D165,Namen!A:C,3,0))","v":"Z"},{"$f":"IF(ISERROR(VLOOKUP(D165,Namen!A:D,4,0)),\"Z\",VLOOKUP(D165,Namen!A:D,4,0))","v":"Z"},{"$f":"IF(R165=\"ja\",$A$1,0)","v":0},null,null,null,null,"","","","",""]
[{"$f":"IF(ISERROR(RANK(B166,$B$4:$B$203,0)),\"\",RANK(B166,$B$4:$B$203,0))","v":""},{"$f":"IF(COUNT(F166:I166)=1,SUM(F166:I166)-50,IF(COUNT(F166:I166)=2,SUM(F166:I166)-100,IF(COUNT(F166:I166)=3,SUM(F166:I166)-150,IF(COUNT(F166:I166)=4,SUM(F166:I166)-200,\"\"))))","v":""},{"$f":"IF(D166=\"\",\"\",L166)","v":""},null,{"$f":"IF(ISERROR(VLOOKUP(D166,Namen!A:B,2,0)),\"\",VLOOKUP(D166,Namen!A:B,2,0))","v":""},null,null,null,null,{"$f":"IF(D166=0,\"\",SUM(T166:W166))","v":""},{"$f":"IF(F166=0,\"\",MAX(F166:I166))","v":""},163,null,null,null,null,{"$f":"IF(ISERROR(VLOOKUP(D166,Namen!A:C,3,0)),\"Z\",VLOOKUP(D166,Namen!A:C,3,0))","v":"Z"},{"$f":"IF(ISERROR(VLOOKUP(D166,Namen!A:D,4,0)),\"Z\",VLOOKUP(D166,Namen!A:D,4,0))","v":"Z"},{"$f":"IF(R166=\"ja\",$A$1,0)","v":0},null,null,null,null,"","","","",""]
[{"$f":"IF(ISERROR(RANK(B167,$B$4:$B$203,0)),\"\",RANK(B167,$B$4:$B$203,0))","v":""},{"$f":"IF(COUNT(F167:I167)=1,SUM(F167:I167)-50,IF(COUNT(F167:I167)=2,SUM(F167:I167)-100,IF(COUNT(F167:I167)=3,SUM(F167:I167)-150,IF(COUNT(F167:I167)=4,SUM(F167:I167)-200,\"\"))))","v":""},{"$f":"IF(D167=\"\",\"\",L167)","v":""},null,{"$f":"IF(ISERROR(VLOOKUP(D167,Namen!A:B,2,0)),\"\",VLOOKUP(D167,Namen!A:B,2,0))","v":""},null,null,null,null,{"$f":"IF(D167=0,\"\",SUM(T167:W167))","v":""},{"$f":"IF(F167=0,\"\",MAX(F167:I167))","v":""},164,null,null,null,null,{"$f":"IF(ISERROR(VLOOKUP(D167,Namen!A:C,3,0)),\"Z\",VLOOKUP(D167,Namen!A:C,3,0))","v":"Z"},{"$f":"IF(ISERROR(VLOOKUP(D167,Namen!A:D,4,0)),\"Z\",VLOOKUP(D167,Namen!A:D,4,0))","v":"Z"},{"$f":"IF(R167=\"ja\",$A$1,0)","v":0},null,null,null,null,"","","","",""]
[{"$f":"IF(ISERROR(RANK(B168,$B$4:$B$203,0)),\"\",RANK(B168,$B$4:$B$203,0))","v":""},{"$f":"IF(COUNT(F168:I168)=1,SUM(F168:I168)-50,IF(COUNT(F168:I168)=2,SUM(F168:I168)-100,IF(COUNT(F168:I168)=3,SUM(F168:I168)-150,IF(COUNT(F168:I168)=4,SUM(F168:I168)-200,\"\"))))","v":""},{"$f":"IF(D168=\"\",\"\",L168)","v":""},null,{"$f":"IF(ISERROR(VLOOKUP(D168,Namen!A:B,2,0)),\"\",VLOOKUP(D168,Namen!A:B,2,0))","v":""},null,null,null,null,{"$f":"IF(D168=0,\"\",SUM(T168:W168))","v":""},{"$f":"IF(F168=0,\"\",MAX(F168:I168))","v":""},165,null,null,null,null,{"$f":"IF(ISERROR(VLOOKUP(D168,Namen!A:C,3,0)),\"Z\",VLOOKUP(D168,Namen!A:C,3,0))","v":"Z"},{"$f":"IF(ISERROR(VLOOKUP(D168,Namen!A:D,4,0)),\"Z\",VLOOKUP(D168,Namen!A:D,4,0))","v":"Z"},{"$f":"IF(R168=\"ja\",$A$1,0)","v":0},null,null,null,null,"","","","",""]
[{"$f":"IF(ISERROR(RANK(B169,$B$4:$B$203,0)),\"\",RANK(B169,$B$4:$B$203,0))","v":""},{"$f":"IF(COUNT(F169:I169)=1,SUM(F169:I169)-50,IF(COUNT(F169:I169)=2,SUM(F169:I169)-100,IF(COUNT(F169:I169)=3,SUM(F169:I169)-150,IF(COUNT(F169:I169)=4,SUM(F169:I169)-200,\"\"))))","v":""},{"$f":"IF(D169=\"\",\"\",L169)","v":""},null,{"$f":"IF(ISERROR(VLOOKUP(D169,Namen!A:B,2,0)),\"\",VLOOKUP(D169,Namen!A:B,2,0))","v":""},null,null,null,null,{"$f":"IF(D169=0,\"\",SUM(T169:W169))","v":""},{"$f":"IF(F169=0,\"\",MAX(F169:I169))","v":""},166,null,null,null,null,{"$f":"IF(ISERROR(VLOOKUP(D169,Namen!A:C,3,0)),\"Z\",VLOOKUP(D169,Namen!A:C,3,0))","v":"Z"},{"$f":"IF(ISERROR(VLOOKUP(D169,Namen!A:D,4,0)),\"Z\",VLOOKUP(D169,Namen!A:D,4,0))","v":"Z"},{"$f":"IF(R169=\"ja\",$A$1,0)","v":0},null,null,null,null,"","","","",""]
[{"$f":"IF(ISERROR(RANK(B170,$B$4:$B$203,0)),\"\",RANK(B170,$B$4:$B$203,0))","v":""},{"$f":"IF(COUNT(F170:I170)=1,SUM(F170:I170)-50,IF(COUNT(F170:I170)=2,SUM(F170:I170)-100,IF(COUNT(F170:I170)=3,SUM(F170:I170)-150,IF(COUNT(F170:I170)=4,SUM(F170:I170)-200,\"\"))))","v":""},{"$f":"IF(D170=\"\",\"\",L170)","v":""},null,{"$f":"IF(ISERROR(VLOOKUP(D170,Namen!A:B,2,0)),\"\",VLOOKUP(D170,Namen!A:B,2,0))","v":""},null,null,null,null,{"$f":"IF(D170=0,\"\",SUM(T170:W170))","v":""},{"$f":"IF(F170=0,\"\",MAX(F170:I170))","v":""},167,null,null,null,null,{"$f":"IF(ISERROR(VLOOKUP(D170,Namen!A:C,3,0)),\"Z\",VLOOKUP(D170,Namen!A:C,3,0))","v":"Z"},{"$f":"IF(ISERROR(VLOOKUP(D170,Namen!A:D,4,0)),\"Z\",VLOOKUP(D170,Namen!A:D,4,0))","v":"Z"},{"$f":"IF(R170=\"ja\",$A$1,0)","v":0},null,null,null,null,{"$f":"IFERROR(B170+(K170*0.0001),\"\")","v":""},"","","",""]
[{"$f":"IF(ISERROR(RANK(B171,$B$4:$B$203,0)),\"\",RANK(B171,$B$4:$B$203,0))","v":""},{"$f":"IF(COUNT(F171:I171)=1,SUM(F171:I171)-50,IF(COUNT(F171:I171)=2,SUM(F171:I171)-100,IF(COUNT(F171:I171)=3,SUM(F171:I171)-150,IF(COUNT(F171:I171)=4,SUM(F171:I171)-200,\"\"))))","v":""},{"$f":"IF(D171=\"\",\"\",L171)","v":""},null,{"$f":"IF(ISERROR(VLOOKUP(D171,Namen!A:B,2,0)),\"\",VLOOKUP(D171,Namen!A:B,2,0))","v":""},null,null,null,null,{"$f":"IF(D171=0,\"\",SUM(T171:W171))","v":""},{"$f":"IF(F171=0,\"\",MAX(F171:I171))","v":""},168,null,null,null,null,{"$f":"IF(ISERROR(VLOOKUP(D171,Namen!A:C,3,0)),\"Z\",VLOOKUP(D171,Namen!A:C,3,0))","v":"Z"},{"$f":"IF(ISERROR(VLOOKUP(D171,Namen!A:D,4,0)),\"Z\",VLOOKUP(D171,Namen!A:D,4,0))","v":"Z"},{"$f":"IF(R171=\"ja\",$A$1,0)","v":0},null,null,null,null,"","","","",""]
[{"$f":"IF(ISERROR(RANK(B172,$B$4:$B$203,0)),\"\",RANK(B172,$B$4:$B$203,0))","v":""},{"$f":"IF(COUNT(F172:I172)=1,SUM(F172:I172)-50,IF(COUNT(F172:I172)=2,SUM(F172:I172)-100,IF(COUNT(F172:I172)=3,SUM(F172:I172)-150,IF(COUNT(F172:I172)=4,SUM(F172:I172)-200,\"\"))))","v":""},{"$f":"IF(D172=\"\",\"\",L172)","v":""},null,{"$f":"IF(ISERROR(VLOOKUP(D172,Namen!A:B,2,0)),\"\",VLOOKUP(D172,Namen!A:B,2,0))","v":""},null,null,null,null,{"$f":"IF(D172=0,\"\",SUM(T172:W172))","v":""},{"$f":"IF(F172=0,\"\",MAX(F172:I172))","v":""},169,null,null,null,null,{"$f":"IF(ISERROR(VLOOKUP(D172,Namen!A:C,3,0)),\"Z\",VLOOKUP(D172,Namen!A:C,3,0))","v":"Z"},{"$f":"IF(ISERROR(VLOOKUP(D172,Namen!A:D,4,0)),\"Z\",VLOOKUP(D172,Namen!A:D,4,0))","v":"Z"},{"$f":"IF(R172=\"ja\",$A$1,0)","v":0},null,null,null,null,"","","","",""]
[{"$f":"IF(ISERROR(RANK(B173,$B$4:$B$203,0)),\"\",RANK(B173,$B$4:$B$203,0))","v":""},{"$f":"IF(COUNT(F173:I173)=1,SUM(F173:I173)-50,IF(COUNT(F173:I173)=2,SUM(F173:I173)-100,IF(COUNT(F173:I173)=3,SUM(F173:I173)-150,IF(COUNT(F173:I173)=4,SUM(F173:I173)-200,\"\"))))","v":""},{"$f":"IF(D173=\"\",\"\",L173)","v":""},null,{"$f":"IF(ISERROR(VLOOKUP(D173,Namen!A:B,2,0)),\"\",VLOOKUP(D173,Namen!A:B,2,0))","v":""},null,null,null,null,{"$f":"IF(D173=0,\"\",SUM(T173:W173))","v":""},{"$f":"IF(F173=0,\"\",MAX(F173:I173))","v":""},170,null,null,null,null,{"$f":"IF(ISERROR(VLOOKUP(D173,Namen!A:C,3,0)),\"Z\",VLOOKUP(D173,Namen!A:C,3,0))","v":"Z"},{"$f":"IF(ISERROR(VLOOKUP(D173,Namen!A:D,4,0)),\"Z\",VLOOKUP(D173,Namen!A:D,4,0))","v":"Z"},{"$f":"IF(R173=\"ja\",$A$1,0)","v":0},null,null,null,null,"","","","",""]
[{"$f":"IF(ISERROR(RANK(B174,$B$4:$B$203,0)),\"\",RANK(B174,$B$4:$B$203,0))","v":""},{"$f":"IF(COUNT(F174:I174)=1,SUM(F174:I174)-50,IF(COUNT(F174:I174)=2,SUM(F174:I174)-100,IF(COUNT(F174:I174)=3,SUM(F174:I174)-150,IF(COUNT(F174:I174)=4,SUM(F174:I174)-200,\"\"))))","v":""},{"$f":"IF(D174=\"\",\"\",L174)","v":""},null,{"$f":"IF(ISERROR(VLOOKUP(D174,Namen!A:B,2,0)),\"\",VLOOKUP(D174,Namen!A:B,2,0))","v":""},null,null,null,null,{"$f":"IF(D174=0,\"\",SUM(T174:W174))","v":""},{"$f":"IF(F174=0,\"\",MAX(F174:I174))","v":""},171,null,null,null,null,{"$f":"IF(ISERROR(VLOOKUP(D174,Namen!A:C,3,0)),\"Z\",VLOOKUP(D174,Namen!A:C,3,0))","v":"Z"},{"$f":"IF(ISERROR(VLOOKUP(D174,Namen!A:D,4,0)),\"Z\",VLOOKUP(D174,Namen!A:D,4,0))","v":"Z"},{"$f":"IF(R174=\"ja\",$A$1,0)","v":0},null,null,null,null,"","","","",""]
[{"$f":"IF(ISERROR(RANK(B175,$B$4:$B$203,0)),\"\",RANK(B175,$B$4:$B$203,0))","v":""},{"$f":"IF(COUNT(F175:I175)=1,SUM(F175:I175)-50,IF(COUNT(F175:I175)=2,SUM(F175:I175)-100,IF(COUNT(F175:I175)=3,SUM(F175:I175)-150,IF(COUNT(F175:I175)=4,SUM(F175:I175)-200,\"\"))))","v":""},{"$f":"IF(D175=\"\",\"\",L175)","v":""},null,{"$f":"IF(ISERROR(VLOOKUP(D175,Namen!A:B,2,0)),\"\",VLOOKUP(D175,Namen!A:B,2,0))","v":""},null,null,null,null,{"$f":"IF(D175=0,\"\",SUM(T175:W175))","v":""},{"$f":"IF(F175=0,\"\",MAX(F175:I175))","v":""},172,null,null,null,null,{"$f":"IF(ISERROR(VLOOKUP(D175,Namen!A:C,3,0)),\"Z\",VLOOKUP(D175,Namen!A:C,3,0))","v":"Z"},{"$f":"IF(ISERROR(VLOOKUP(D175,Namen!A:D,4,0)),\"Z\",VLOOKUP(D175,Namen!A:D,4,0))","v":"Z"},{"$f":"IF(R175=\"ja\",$A$1,0)","v":0},null,null,null,null,"","","","",""]
[{"$f":"IF(ISERROR(RANK(B176,$B$4:$B$203,0)),\"\",RANK(B176,$B$4:$B$203,0))","v":""},{"$f":"IF(COUNT(F176:I176)=1,SUM(F176:I176)-50,IF(COUNT(F176:I176)=2,SUM(F176:I176)-100,IF(COUNT(F176:I176)=3,SUM(F176:I176)-150,IF(COUNT(F176:I176)=4,SUM(F176:I176)-200,\"\"))))","v":""},{"$f":"IF(D176=\"\",\"\",L176)","v":""},null,{"$f":"IF(ISERROR(VLOOKUP(D176,Namen!A:B,2,0)),\"\",VLOOKUP(D176,Namen!A:B,2,0))","v":""},null,null,null,null,{"$f":"IF(D176=0,\"\",SUM(T176:W176))","v":""},{"$f":"IF(F176=0,\"\",MAX(F176:I176))","v":""},173,null,null,null,null,{"$f":"IF(ISERROR(VLOOKUP(D176,Namen!A:C,3,0)),\"Z\",VLOOKUP(D176,Namen!A:C,3,0))","v":"Z"},{"$f":"IF(ISERROR(VLOOKUP(D176,Namen!A:D,4,0)),\"Z\",VLOOKUP(D176,Namen!A:D,4,0))","v":"Z"},{"$f":"IF(R176=\"ja\",$A$1,0)","v":0},null,null,null,null,"","","","",""]
[{"$f":"IF(ISERROR(RANK(B177,$B$4:$B$203,0)),\"\",RANK(B177,$B$4:$B$203,0))","v":""},{"$f":"IF(COUNT(F177:I177)=1,SUM(F177:I177)-50,IF(COUNT(F177:I177)=2,SUM(F177:I177)-100,IF(COUNT(F177:I177)=3,SUM(F177:I177)-150,IF(COUNT(F177:I177)=4,SUM(F177:I177)-200,\"\"))))","v":""},{"$f":"IF(D177=\"\",\"\",L177)","v":""},null,{"$f":"IF(ISERROR(VLOOKUP(D177,Namen!A:B,2,0)),\"\",VLOOKUP(D177,Namen!A:B,2,0))","v":""},null,null,null,null,{"$f":"IF(D177=0,\"\",SUM(T177:W177))","v":""},{"$f":"IF(F177=0,\"\",MAX(F177:I177))","v":""},174,null,null,null,null,{"$f":"IF(ISERROR(VLOOKUP(D177,Namen!A:C,3,0)),\"Z\",VLOOKUP(D177,Namen!A:C,3,0))","v":"Z"},{"$f":"IF(ISERROR(VLOOKUP(D177,Namen!A:D,4,0)),\"Z\",VLOOKUP(D177,Namen!A:D,4,0))","v":"Z"},{"$f":"IF(R177=\"ja\",$A$1,0)","v":0},null,null,null,null,"","","","",""]
[{"$f":"IF(ISERROR(RANK(B178,$B$4:$B$203,0)),\"\",RANK(B178,$B$4:$B$203,0))","v":""},{"$f":"IF(COUNT(F178:I178)=1,SUM(F178:I178)-50,IF(COUNT(F178:I178)=2,SUM(F178:I178)-100,IF(COUNT(F178:I178)=3,SUM(F178:I178)-150,IF(COUNT(F178:I178)=4,SUM(F178:I178)-200,\"\"))))","v":""},{"$f":"IF(D178=\"\",\"\",L178)","v":""},null,{"$f":"IF(ISERROR(VLOOKUP(D178,Namen!A:B,2,0)),\"\",VLOOKUP(D178,Namen!A:B,2,0))","v":""},null,null,null,null,{"$f":"IF(D178=0,\"\",SUM(T178:W178))","v":""},{"$f":"IF(F178=0,\"\",MAX(F178:I178))","v":""},175,null,null,null,null,{"$f":"IF(ISERROR(VLOOKUP(D178,Namen!A:C,3,0)),\"Z\",VLOOKUP(D178,Namen!A:C,3,0))","v":"Z"},{"$f":"IF(ISERROR(VLOOKUP(D178,Namen!A:D,4,0)),\"Z\",VLOOKUP(D178,Namen!A:D,4,0))","v":"Z"},{"$f":"IF(R178=\"ja\",$A$1,0)","v":0},null,null,null,null,"","","","",""]
[{"$f":"IF(ISERROR(RANK(B179,$B$4:$B$203,0)),\"\",RANK(B179,$B$4:$B$203,0))","v":""},{"$f":"IF(COUNT(F179:I179)=1,SUM(F179:I179)-50,IF(COUNT(F179:I179)=2,SUM(F179:I179)-100,IF(COUNT(F179:I179)=3,SUM(F179:I179)-150,IF(COUNT(F179:I179)=4,SUM(F179:I179)-200,\"\"))))","v":""},{"$f":"IF(D179=\"\",\"\",L179)","v":""},null,{"$f":"IF(ISERROR(VLOOKUP(D179,Namen!A:B,2,0)),\"\",VLOOKUP(D179,Namen!A:B,2,0))","v":""},null,null,null,null,{"$f":"IF(D179=0,\"\",SUM(T179:W179))","v":""},{"$f":"IF(F179=0,\"\",MAX(F179:I179))","v":""},176,null,null,null,null,{"$f":"IF(ISERROR(VLOOKUP(D179,Namen!A:C,3,0)),\"Z\",VLOOKUP(D179,Namen!A:C,3,0))","v":"Z"},{"$f":"IF(ISERROR(VLOOKUP(D179,Namen!A:D,4,0)),\"Z\",VLOOKUP(D179,Namen!A:D,4,0))","v":"Z"},{"$f":"IF(R179=\"ja\",$A$1,0)","v":0},null,null,null,null,"","","","",""]
[{"$f":"IF(ISERROR(RANK(B180,$B$4:$B$203,0)),\"\",RANK(B180,$B$4:$B$203,0))","v":""},{"$f":"IF(COUNT(F180:I180)=1,SUM(F180:I180)-50,IF(COUNT(F180:I180)=2,SUM(F180:I180)-100,IF(COUNT(F180:I180)=3,SUM(F180:I180)-150,IF(COUNT(F180:I180)=4,SUM(F180:I180)-200,\"\"))))","v":""},{"$f":"IF(D180=\"\",\"\",L180)","v":""},null,{"$f":"IF(ISERROR(VLOOKUP(D180,Namen!A:B,2,0)),\"\",VLOOKUP(D180,Namen!A:B,2,0))","v":""},null,null,null,null,{"$f":"IF(D180=0,\"\",SUM(T180:W180))","v":""},{"$f":"IF(F180=0,\"\",MAX(F180:I180))","v":""},177,null,null,null,null,{"$f":"IF(ISERROR(VLOOKUP(D180,Namen!A:C,3,0)),\"Z\",VLOOKUP(D180,Namen!A:C,3,0))","v":"Z"},{"$f":"IF(ISERROR(VLOOKUP(D180,Namen!A:D,4,0)),\"Z\",VLOOKUP(D180,Namen!A:D,4,0))","v":"Z"},{"$f":"IF(R180=\"ja\",$A$1,0)","v":0},null,null,null,null,"","","","",""]
[{"$f":"IF(ISERROR(RANK(B181,$B$4:$B$203,0)),\"\",RANK(B181,$B$4:$B$203,0))","v":""},{"$f":"IF(COUNT(F181:I181)=1,SUM(F181:I181)-50,IF(COUNT(F181:I181)=2,SUM(F181:I181)-100,IF(COUNT(F181:I181)=3,SUM(F181:I181)-150,IF(COUNT(F181:I181)=4,SUM(F181:I181)-200,\"\"))))","v":""},{"$f":"IF(D181=\"\",\"\",L181)","v":""},null,{"$f":"IF(ISERROR(VLOOKUP(D181,Namen!A:B,2,0)),\"\",VLOOKUP(D181,Namen!A:B,2,0))","v":""},null,null,null,null,{"$f":"IF(D181=0,\"\",SUM(T181:W181))","v":""},{"$f":"IF(F181=0,\"\",MAX(F181:I181))","v":""},178,null,null,null,null,{"$f":"IF(ISERROR(VLOOKUP(D181,Namen!A:C,3,0)),\"Z\",VLOOKUP(D181,Namen!A:C,3,0))","v":"Z"},{"$f":"IF(ISERROR(VLOOKUP(D181,Namen!A:D,4,0)),\"Z\",VLOOKUP(D181,Namen!A:D,4,0))","v":"Z"},{"$f":"IF(R181=\"ja\",$A$1,0)","v":0},null,null,null,null,"","","","",""]
[{"$f":"IF(ISERROR(RANK(B182,$B$4:$B$203,0)),\"\",RANK(B182,$B$4:$B$203,0))","v":""},{"$f":"IF(COUNT(F182:I182)=1,SUM(F182:I182)-50,IF(COUNT(F182:I182)=2,SUM(F182:I182)-100,IF(COUNT(F182:I182)=3,SUM(F182:I182)-150,IF(COUNT(F182:I182)=4,SUM(F182:I182)-200,\"\"))))","v":""},{"$f":"IF(D182=\"\",\"\",L182)","v":""},null,{"$f":"IF(ISERROR(VLOOKUP(D182,Namen!A:B,2,0)),\"\",VLOOKUP(D182,Namen!A:B,2,0))","v":""},null,null,null,null,{"$f":"IF(D182=0,\"\",SUM(T182:W182))","v":""},{"$f":"IF(F182=0,\"\",MAX(F182:I182))","v":""},179,null,null,null,null,{"$f":"IF(ISERROR(VLOOKUP(D182,Namen!A:C,3,0)),\"Z\",VLOOKUP(D182,Namen!A:C,3,0))","v":"Z"},{"$f":"IF(ISERROR(VLOOKUP(D182,Namen!A:D,4,0)),\"Z\",VLOOKUP(D182,Namen!A:D,4,0))","v":"Z"},{"$f":"IF(R182=\"ja\",$A$1,0)","v":0},null,null,null,null,"","","","",""]
[{"$f":"IF(ISERROR(RANK(B183,$B$4:$B$203,0)),\"\",RANK(B183,$B$4:$B$203,0))","v":""},{"$f":"IF(COUNT(F183:I183)=1,SUM(F183:I183)-50,IF(COUNT(F183:I183)=2,SUM(F183:I183)-100,IF(COUNT(F183:I183)=3,SUM(F183:I183)-150,IF(COUNT(F183:I183)=4,SUM(F183:I183)-200,\"\"))))","v":""},{"$f":"IF(D183=\"\",\"\",L183)","v":""},null,{"$f":"IF(ISERROR(VLOOKUP(D183,Namen!A:B,2,0)),\"\",VLOOKUP(D183,Namen!A:B,2,0))","v":""},null,null,null,null,{"$f":"IF(D183=0,\"\",SUM(T183:W183))","v":""},{"$f":"IF(F183=0,\"\",MAX(F183:I183))","v":""},180,null,null,null,null,{"$f":"IF(ISERROR(VLOOKUP(D183,Namen!A:C,3,0)),\"Z\",VLOOKUP(D183,Namen!A:C,3,0))","v":"Z"},{"$f":"IF(ISERROR(VLOOKUP(D183,Namen!A:D,4,0)),\"Z\",VLOOKUP(D183,Namen!A:D,4,0))","v":"Z"},{"$f":"IF(R183=\"ja\",$A$1,0)","v":0},null,null,null,null,"","","","",""]
[{"$f":"IF(ISERROR(RANK(B184,$B$4:$B$203,0)),\"\",RANK(B184,$B$4:$B$203,0))","v":""},{"$f":"IF(COUNT(F184:I184)=1,SUM(F184:I184)-50,IF(COUNT(F184:I184)=2,SUM(F184:I184)-100,IF(COUNT(F184:I184)=3,SUM(F184:I184)-150,IF(COUNT(F184:I184)=4,SUM(F184:I184)-200,\"\"))))","v":""},{"$f":"IF(D184=\"\",\"\",L184)","v":""},null,{"$f":"IF(ISERROR(VLOOKUP(D184,Namen!A:B,2,0)),\"\",VLOOKUP(D184,Namen!A:B,2,0))","v":""},null,null,null,null,{"$f":"IF(D184=0,\"\",SUM(T184:W184))","v":""},{"$f":"IF(F184=0,\"\",MAX(F184:I184))","v":""},181,null,null,null,null,{"$f":"IF(ISERROR(VLOOKUP(D184,Namen!A:C,3,0)),\"Z\",VLOOKUP(D184,Namen!A:C,3,0))","v":"Z"},{"$f":"IF(ISERROR(VLOOKUP(D184,Namen!A:D,4,0)),\"Z\",VLOOKUP(D184,Namen!A:D,4,0))","v":"Z"},{"$f":"IF(R184=\"ja\",$A$1,0)","v":0},null,null,null,null,"","","","",""]
[{"$f":"IF(ISERROR(RANK(B185,$B$4:$B$203,0)),\"\",RANK(B185,$B$4:$B$203,0))","v":""},{"$f":"IF(COUNT(F185:I185)=1,SUM(F185:I185)-50,IF(COUNT(F185:I185)=2,SUM(F185:I185)-100,IF(COUNT(F185:I185)=3,SUM(F185:I185)-150,IF(COUNT(F185:I185)=4,SUM(F185:I185)-200,\"\"))))","v":""},{"$f":"IF(D185=\"\",\"\",L185)","v":""},null,{"$f":"IF(ISERROR(VLOOKUP(D185,Namen!A:B,2,0)),\"\",VLOOKUP(D185,Namen!A:B,2,0))","v":""},null,null,null,null,{"$f":"IF(D185=0,\"\",SUM(T185:W185))","v":""},{"$f":"IF(F185=0,\"\",MAX(F185:I185))","v":""},182,null,null,null,null,{"$f":"IF(ISERROR(VLOOKUP(D185,Namen!A:C,3,0)),\"Z\",VLOOKUP(D185,Namen!A:C,3,0))","v":"Z"},{"$f":"IF(ISERROR(VLOOKUP(D185,Namen!A:D,4,0)),\"Z\",VLOOKUP(D185,Namen!A:D,4,0))","v":"Z"},{"$f":"IF(R185=\"ja\",$A$1,0)","v":0},null,null,null,null,"","","","",""]
[{"$f":"IF(ISERROR(RANK(B186,$B$4:$B$203,0)),\"\",RANK(B186,$B$4:$B$203,0))","v":""},{"$f":"IF(COUNT(F186:I186)=1,SUM(F186:I186)-50,IF(COUNT(F186:I186)=2,SUM(F186:I186)-100,IF(COUNT(F186:I186)=3,SUM(F186:I186)-150,IF(COUNT(F186:I186)=4,SUM(F186:I186)-200,\"\"))))","v":""},{"$f":"IF(D186=\"\",\"\",L186)","v":""},null,{"$f":"IF(ISERROR(VLOOKUP(D186,Namen!A:B,2,0)),\"\",VLOOKUP(D186,Namen!A:B,2,0))","v":""},null,null,null,null,{"$f":"IF(D186=0,\"\",SUM(T186:W186))","v":""},{"$f":"IF(F186=0,\"\",MAX(F186:I186))","v":""},183,null,null,null,null,{"$f":"IF(ISERROR(VLOOKUP(D186,Namen!A:C,3,0)),\"Z\",VLOOKUP(D186,Namen!A:C,3,0))","v":"Z"},{"$f":"IF(ISERROR(VLOOKUP(D186,Namen!A:D,4,0)),\"Z\",VLOOKUP(D186,Namen!A:D,4,0))","v":"Z"},{"$f":"IF(R186=\"ja\",$A$1,0)","v":0},null,null,null,null,"","","","",""]
[{"$f":"IF(ISERROR(RANK(B187,$B$4:$B$203,0)),\"\",RANK(B187,$B$4:$B$203,0))","v":""},{"$f":"IF(COUNT(F187:I187)=1,SUM(F187:I187)-50,IF(COUNT(F187:I187)=2,SUM(F187:I187)-100,IF(COUNT(F187:I187)=3,SUM(F187:I187)-150,IF(COUNT(F187:I187)=4,SUM(F187:I187)-200,\"\"))))","v":""},{"$f":"IF(D187=\"\",\"\",L187)","v":""},null,{"$f":"IF(ISERROR(VLOOKUP(D187,Namen!A:B,2,0)),\"\",VLOOKUP(D187,Namen!A:B,2,0))","v":""},null,null,null,null,{"$f":"IF(D187=0,\"\",SUM(T187:W187))","v":""},{"$f":"IF(F187=0,\"\",MAX(F187:I187))","v":""},184,null,null,null,null,{"$f":"IF(ISERROR(VLOOKUP(D187,Namen!A:C,3,0)),\"Z\",VLOOKUP(D187,Namen!A:C,3,0))","v":"Z"},{"$f":"IF(ISERROR(VLOOKUP(D187,Namen!A:D,4,0)),\"Z\",VLOOKUP(D187,Namen!A:D,4,0))","v":"Z"},{"$f":"IF(R187=\"ja\",$A$1,0)","v":0},null,null,null,null,"","","","",""]
[{"$f":"IF(ISERROR(RANK(B188,$B$4:$B$203,0)),\"\",RANK(B188,$B$4:$B$203,0))","v":""},{"$f":"IF(COUNT(F188:I188)=1,SUM(F188:I188)-50,IF(COUNT(F188:I188)=2,SUM(F188:I188)-100,IF(COUNT(F188:I188)=3,SUM(F188:I188)-150,IF(COUNT(F188:I188)=4,SUM(F188:I188)-200,\"\"))))","v":""},{"$f":"IF(D188=\"\",\"\",L188)","v":""},null,{"$f":"IF(ISERROR(VLOOKUP(D188,Namen!A:B,2,0)),\"\",VLOOKUP(D188,Namen!A:B,2,0))","v":""},null,null,null,null,{"$f":"IF(D188=0,\"\",SUM(T188:W188))","v":""},{"$f":"IF(F188=0,\"\",MAX(F188:I188))","v":""},185,null,null,null,null,{"$f":"IF(ISERROR(VLOOKUP(D188,Namen!A:C,3,0)),\"Z\",VLOOKUP(D188,Namen!A:C,3,0))","v":"Z"},{"$f":"IF(ISERROR(VLOOKUP(D188,Namen!A:D,4,0)),\"Z\",VLOOKUP(D188,Namen!A:D,4,0))","v":"Z"},{"$f":"IF(R188=\"ja\",$A$1,0)","v":0},null,null,null,null,"","","","",""]
[{"$f":"IF(ISERROR(RANK(B189,$B$4:$B$203,0)),\"\",RANK(B189,$B$4:$B$203,0))","v":""},{"$f":"IF(COUNT(F189:I189)=1,SUM(F189:I189)-50,IF(COUNT(F189:I189)=2,SUM(F189:I189)-100,IF(COUNT(F189:I189)=3,SUM(F189:I189)-150,IF(COUNT(F189:I189)=4,SUM(F189:I189)-200,\"\"))))","v":""},{"$f":"IF(D189=\"\",\"\",L189)","v":""},null,{"$f":"IF(ISERROR(VLOOKUP(D189,Namen!A:B,2,0)),\"\",VLOOKUP(D189,Namen!A:B,2,0))","v":""},null,null,null,null,{"$f":"IF(D189=0,\"\",SUM(T189:W189))","v":""},{"$f":"IF(F189=0,\"\",MAX(F189:I189))","v":""},186,null,null,null,null,{"$f":"IF(ISERROR(VLOOKUP(D189,Namen!A:C,3,0)),\"Z\",VLOOKUP(D189,Namen!A:C,3,0))","v":"Z"},{"$f":"IF(ISERROR(VLOOKUP(D189,Namen!A:D,4,0)),\"Z\",VLOOKUP(D189,Namen!A:D,4,0))","v":"Z"},{"$f":"IF(R189=\"ja\",$A$1,0)","v":0},null,null,null,null,"","","","",""]
[{"$f":"IF(ISERROR(RANK(B190,$B$4:$B$203,0)),\"\",RANK(B190,$B$4:$B$203,0))","v":""},{"$f":"IF(COUNT(F190:I190)=1,SUM(F190:I190)-50,IF(COUNT(F190:I190)=2,SUM(F190:I190)-100,IF(COUNT(F190:I190)=3,SUM(F190:I190)-150,IF(COUNT(F190:I190)=4,SUM(F190:I190)-200,\"\"))))","v":""},{"$f":"IF(D190=\"\",\"\",L190)","v":""},null,{"$f":"IF(ISERROR(VLOOKUP(D190,Namen!A:B,2,0)),\"\",VLOOKUP(D190,Namen!A:B,2,0))","v":""},null,null,null,null,{"$f":"IF(D190=0,\"\",SUM(T190:W190))","v":""},{"$f":"IF(F190=0,\"\",MAX(F190:I190))","v":""},187,null,null,null,null,{"$f":"IF(ISERROR(VLOOKUP(D190,Namen!A:C,3,0)),\"Z\",VLOOKUP(D190,Namen!A:C,3,0))","v":"Z"},{"$f":"IF(ISERROR(VLOOKUP(D190,Namen!A:D,4,0)),\"Z\",VLOOKUP(D190,Namen!A:D,4,0))","v":"Z"},{"$f":"IF(R190=\"ja\",$A$1,0)","v":0},null,null,null,null,"","","","",""]
[{"$f":"IF(ISERROR(RANK(B191,$B$4:$B$203,0)),\"\",RANK(B191,$B$4:$B$203,0))","v":""},{"$f":"IF(COUNT(F191:I191)=1,SUM(F191:I191)-50,IF(COUNT(F191:I191)=2,SUM(F191:I191)-100,IF(COUNT(F191:I191)=3,SUM(F191:I191)-150,IF(COUNT(F191:I191)=4,SUM(F191:I191)-200,\"\"))))","v":""},{"$f":"IF(D191=\"\",\"\",L191)","v":""},null,{"$f":"IF(ISERROR(VLOOKUP(D191,Namen!A:B,2,0)),\"\",VLOOKUP(D191,Namen!A:B,2,0))","v":""},null,null,null,null,{"$f":"IF(D191=0,\"\",SUM(T191:W191))","v":""},{"$f":"IF(F191=0,\"\",MAX(F191:I191))","v":""},188,null,null,null,null,{"$f":"IF(ISERROR(VLOOKUP(D191,Namen!A:C,3,0)),\"Z\",VLOOKUP(D191,Namen!A:C,3,0))","v":"Z"},{"$f":"IF(ISERROR(VLOOKUP(D191,Namen!A:D,4,0)),\"Z\",VLOOKUP(D191,Namen!A:D,4,0))","v":"Z"},{"$f":"IF(R191=\"ja\",$A$1,0)","v":0},null,null,null,null,"","","","",""]
[{"$f":"IF(ISERROR(RANK(B192,$B$4:$B$203,0)),\"\",RANK(B192,$B$4:$B$203,0))","v":""},{"$f":"IF(COUNT(F192:I192)=1,SUM(F192:I192)-50,IF(COUNT(F192:I192)=2,SUM(F192:I192)-100,IF(COUNT(F192:I192)=3,SUM(F192:I192)-150,IF(COUNT(F192:I192)=4,SUM(F192:I192)-200,\"\"))))","v":""},{"$f":"IF(D192=\"\",\"\",L192)","v":""},null,{"$f":"IF(ISERROR(VLOOKUP(D192,Namen!A:B,2,0)),\"\",VLOOKUP(D192,Namen!A:B,2,0))","v":""},null,null,null,null,{"$f":"IF(D192=0,\"\",SUM(T192:W192))","v":""},{"$f":"IF(F192=0,\"\",MAX(F192:I192))","v":""},189,null,null,null,null,{"$f":"IF(ISERROR(VLOOKUP(D192,Namen!A:C,3,0)),\"Z\",VLOOKUP(D192,Namen!A:C,3,0))","v":"Z"},{"$f":"IF(ISERROR(VLOOKUP(D192,Namen!A:D,4,0)),\"Z\",VLOOKUP(D192,Namen!A:D,4,0))","v":"Z"},{"$f":"IF(R192=\"ja\",$A$1,0)","v":0},null,null,null,null,"","","","",""]
[{"$f":"IF(ISERROR(RANK(B193,$B$4:$B$203,0)),\"\",RANK(B193,$B$4:$B$203,0))","v":""},{"$f":"IF(COUNT(F193:I193)=1,SUM(F193:I193)-50,IF(COUNT(F193:I193)=2,SUM(F193:I193)-100,IF(COUNT(F193:I193)=3,SUM(F193:I193)-150,IF(COUNT(F193:I193)=4,SUM(F193:I193)-200,\"\"))))","v":""},{"$f":"IF(D193=\"\",\"\",L193)","v":""},null,{"$f":"IF(ISERROR(VLOOKUP(D193,Namen!A:B,2,0)),\"\",VLOOKUP(D193,Namen!A:B,2,0))","v":""},null,null,null,null,{"$f":"IF(D193=0,\"\",SUM(T193:W193))","v":""},{"$f":"IF(F193=0,\"\",MAX(F193:I193))","v":""},190,null,null,null,null,{"$f":"IF(ISERROR(VLOOKUP(D193,Namen!A:C,3,0)),\"Z\",VLOOKUP(D193,Namen!A:C,3,0))","v":"Z"},{"$f":"IF(ISERROR(VLOOKUP(D193,Namen!A:D,4,0)),\"Z\",VLOOKUP(D193,Namen!A:D,4,0))","v":"Z"},{"$f":"IF(R193=\"ja\",$A$1,0)","v":0},null,null,null,null,"","","","",""]
[{"$f":"IF(ISERROR(RANK(B194,$B$4:$B$203,0)),\"\",RANK(B194,$B$4:$B$203,0))","v":""},{"$f":"IF(COUNT(F194:I194)=1,SUM(F194:I194)-50,IF(COUNT(F194:I194)=2,SUM(F194:I194)-100,IF(COUNT(F194:I194)=3,SUM(F194:I194)-150,IF(COUNT(F194:I194)=4,SUM(F194:I194)-200,\"\"))))","v":""},{"$f":"IF(D194=\"\",\"\",L194)","v":""},null,{"$f":"IF(ISERROR(VLOOKUP(D194,Namen!A:B,2,0)),\"\",VLOOKUP(D194,Namen!A:B,2,0))","v":""},null,null,null,null,{"$f":"IF(D194=0,\"\",SUM(T194:W194))","v":""},{"$f":"IF(F194=0,\"\",MAX(F194:I194))","v":""},191,null,null,null,null,{"$f":"IF(ISERROR(VLOOKUP(D194,Namen!A:C,3,0)),\"Z\",VLOOKUP(D194,Namen!A:C,3,0))","v":"Z"},{"$f":"IF(ISERROR(VLOOKUP(D194,Namen!A:D,4,0)),\"Z\",VLOOKUP(D194,Namen!A:D,4,0))","v":"Z"},{"$f":"IF(R194=\"ja\",$A$1,0)","v":0},null,null,null,null,"","","","",""]
[{"$f":"IF(ISERROR(RANK(B195,$B$4:$B$203,0)),\"\",RANK(B195,$B$4:$B$203,0))","v":""},{"$f":"IF(COUNT(F195:I195)=1,SUM(F195:I195)-50,IF(COUNT(F195:I195)=2,SUM(F195:I195)-100,IF(COUNT(F195:I195)=3,SUM(F195:I195)-150,IF(COUNT(F195:I195)=4,SUM(F195:I195)-200,\"\"))))","v":""},{"$f":"IF(D195=\"\",\"\",L195)","v":""},null,{"$f":"IF(ISERROR(VLOOKUP(D195,Namen!A:B,2,0)),\"\",VLOOKUP(D195,Namen!A:B,2,0))","v":""},null,null,null,null,{"$f":"IF(D195=0,\"\",SUM(T195:W195))","v":""},{"$f":"IF(F195=0,\"\",MAX(F195:I195))","v":""},192,null,null,null,null,{"$f":"IF(ISERROR(VLOOKUP(D195,Namen!A:C,3,0)),\"Z\",VLOOKUP(D195,Namen!A:C,3,0))","v":"Z"},{"$f":"IF(ISERROR(VLOOKUP(D195,Namen!A:D,4,0)),\"Z\",VLOOKUP(D195,Namen!A:D,4,0))","v":"Z"},{"$f":"IF(R195=\"ja\",$A$1,0)","v":0},null,null,null,null,"","","","",""]
[{"$f":"IF(ISERROR(RANK(B196,$B$4:$B$203,0)),\"\",RANK(B196,$B$4:$B$203,0))","v":""},{"$f":"IF(COUNT(F196:I196)=1,SUM(F196:I196)-50,IF(COUNT(F196:I196)=2,SUM(F196:I196)-100,IF(COUNT(F196:I196)=3,SUM(F196:I196)-150,IF(COUNT(F196:I196)=4,SUM(F196:I196)-200,\"\"))))","v":""},{"$f":"IF(D196=\"\",\"\",L196)","v":""},null,{"$f":"IF(ISERROR(VLOOKUP(D196,Namen!A:B,2,0)),\"\",VLOOKUP(D196,Namen!A:B,2,0))","v":""},null,null,null,null,{"$f":"IF(D196=0,\"\",SUM(T196:W196))","v":""},{"$f":"IF(F196=0,\"\",MAX(F196:I196))","v":""},193,null,null,null,null,{"$f":"IF(ISERROR(VLOOKUP(D196,Namen!A:C,3,0)),\"Z\",VLOOKUP(D196,Namen!A:C,3,0))","v":"Z"},{"$f":"IF(ISERROR(VLOOKUP(D196,Namen!A:D,4,0)),\"Z\",VLOOKUP(D196,Namen!A:D,4,0))","v":"Z"},{"$f":"IF(R196=\"ja\",$A$1,0)","v":0},null,null,null,null,"","","","",""]
[{"$f":"IF(ISERROR(RANK(B197,$B$4:$B$203,0)),\"\",RANK(B197,$B$4:$B$203,0))","v":""},{"$f":"IF(COUNT(F197:I197)=1,SUM(F197:I197)-50,IF(COUNT(F197:I197)=2,SUM(F197:I197)-100,IF(COUNT(F197:I197)=3,SUM(F197:I197)-150,IF(COUNT(F197:I197)=4,SUM(F197:I197)-200,\"\"))))","v":""},{"$f":"IF(D197=\"\",\"\",L197)","v":""},null,{"$f":"IF(ISERROR(VLOOKUP(D197,Namen!A:B,2,0)),\"\",VLOOKUP(D197,Namen!A:B,2,0))","v":""},null,null,null,null,{"$f":"IF(D197=0,\"\",SUM(T197:W197))","v":""},{"$f":"IF(F197=0,\"\",MAX(F197:I197))","v":""},194,null,null,null,null,{"$f":"IF(ISERROR(VLOOKUP(D197,Namen!A:C,3,0)),\"Z\",VLOOKUP(D197,Namen!A:C,3,0))","v":"Z"},{"$f":"IF(ISERROR(VLOOKUP(D197,Namen!A:D,4,0)),\"Z\",VLOOKUP(D197,Namen!A:D,4,0))","v":"Z"},{"$f":"IF(R197=\"ja\",$A$1,0)","v":0},null,null,null,null,"",{"$f":"IF(ISERROR(RANK(AA197,$AA$4:$AA$203,0)),\"\",RANK(AA197,$AA$4:$AA$203,0))","v":""},{"$f":"IFERROR(LARGE(F197:I197,2),\"\")","v":""},{"$f":"IFERROR(LARGE(F197:I197,3),\"\")","v":""},{"$f":"IFERROR(LARGE(F197:I197,4),\"\")","v":""}]
[{"$f":"IF(ISERROR(RANK(B198,$B$4:$B$203,0)),\"\",RANK(B198,$B$4:$B$203,0))","v":""},{"$f":"IF(COUNT(F198:I198)=1,SUM(F198:I198)-50,IF(COUNT(F198:I198)=2,SUM(F198:I198)-100,IF(COUNT(F198:I198)=3,SUM(F198:I198)-150,IF(COUNT(F198:I198)=4,SUM(F198:I198)-200,\"\"))))","v":""},{"$f":"IF(D198=\"\",\"\",L198)","v":""},null,{"$f":"IF(ISERROR(VLOOKUP(D198,Namen!A:B,2,0)),\"\",VLOOKUP(D198,Namen!A:B,2,0))","v":""},null,null,null,null,{"$f":"IF(D198=0,\"\",SUM(T198:W198))","v":""},{"$f":"IF(F198=0,\"\",MAX(F198:I198))","v":""},195,null,null,null,null,{"$f":"IF(ISERROR(VLOOKUP(D198,Namen!A:C,3,0)),\"Z\",VLOOKUP(D198,Namen!A:C,3,0))","v":"Z"},{"$f":"IF(ISERROR(VLOOKUP(D198,Namen!A:D,4,0)),\"Z\",VLOOKUP(D198,Namen!A:D,4,0))","v":"Z"},{"$f":"IF(R198=\"ja\",$A$1,0)","v":0},null,null,null,null,"","","","",""]
[{"$f":"IF(ISERROR(RANK(B199,$B$4:$B$203,0)),\"\",RANK(B199,$B$4:$B$203,0))","v":""},{"$f":"IF(COUNT(F199:I199)=1,SUM(F199:I199)-50,IF(COUNT(F199:I199)=2,SUM(F199:I199)-100,IF(COUNT(F199:I199)=3,SUM(F199:I199)-150,IF(COUNT(F199:I199)=4,SUM(F199:I199)-200,\"\"))))","v":""},{"$f":"IF(D199=\"\",\"\",L199)","v":""},null,{"$f":"IF(ISERROR(VLOOKUP(D199,Namen!A:B,2,0)),\"\",VLOOKUP(D199,Namen!A:B,2,0))","v":""},null,null,null,null,{"$f":"IF(D199=0,\"\",SUM(T199:W199))","v":""},{"$f":"IF(F199=0,\"\",MAX(F199:I199))","v":""},196,null,null,null,null,{"$f":"IF(ISERROR(VLOOKUP(D199,Namen!A:C,3,0)),\"Z\",VLOOKUP(D199,Namen!A:C,3,0))","v":"Z"},{"$f":"IF(ISERROR(VLOOKUP(D199,Namen!A:D,4,0)),\"Z\",VLOOKUP(D199,Namen!A:D,4,0))","v":"Z"},{"$f":"IF(R199=\"ja\",$A$1,0)","v":0},null,null,null,null,"","","","",""]
[{"$f":"IF(ISERROR(RANK(B200,$B$4:$B$203,0)),\"\",RANK(B200,$B$4:$B$203,0))","v":""},{"$f":"IF(COUNT(F200:I200)=1,SUM(F200:I200)-50,IF(COUNT(F200:I200)=2,SUM(F200:I200)-100,IF(COUNT(F200:I200)=3,SUM(F200:I200)-150,IF(COUNT(F200:I200)=4,SUM(F200:I200)-200,\"\"))))","v":""},{"$f":"IF(D200=\"\",\"\",L200)","v":""},null,{"$f":"IF(ISERROR(VLOOKUP(D200,Namen!A:B,2,0)),\"\",VLOOKUP(D200,Namen!A:B,2,0))","v":""},null,null,null,null,{"$f":"IF(D200=0,\"\",SUM(T200:W200))","v":""},{"$f":"IF(F200=0,\"\",MAX(F200:I200))","v":""},197,null,null,null,null,{"$f":"IF(ISERROR(VLOOKUP(D200,Namen!A:C,3,0)),\"Z\",VLOOKUP(D200,Namen!A:C,3,0))","v":"Z"},{"$f":"IF(ISERROR(VLOOKUP(D200,Namen!A:D,4,0)),\"Z\",VLOOKUP(D200,Namen!A:D,4,0))","v":"Z"},{"$f":"IF(R200=\"ja\",$A$1,0)","v":0},null,null,null,null,"","","","",""]
[{"$f":"IF(ISERROR(RANK(B201,$B$4:$B$203,0)),\"\",RANK(B201,$B$4:$B$203,0))","v":""},{"$f":"IF(COUNT(F201:I201)=1,SUM(F201:I201)-50,IF(COUNT(F201:I201)=2,SUM(F201:I201)-100,IF(COUNT(F201:I201)=3,SUM(F201:I201)-150,IF(COUNT(F201:I201)=4,SUM(F201:I201)-200,\"\"))))","v":""},{"$f":"IF(D201=\"\",\"\",L201)","v":""},null,{"$f":"IF(ISERROR(VLOOKUP(D201,Namen!A:B,2,0)),\"\",VLOOKUP(D201,Namen!A:B,2,0))","v":""},null,null,null,null,{"$f":"IF(D201=0,\"\",SUM(T201:W201))","v":""},{"$f":"IF(F201=0,\"\",MAX(F201:I201))","v":""},198,null,null,null,null,{"$f":"IF(ISERROR(VLOOKUP(D201,Namen!A:C,3,0)),\"Z\",VLOOKUP(D201,Namen!A:C,3,0))","v":"Z"},{"$f":"IF(ISERROR(VLOOKUP(D201,Namen!A:D,4,0)),\"Z\",VLOOKUP(D201,Namen!A:D,4,0))","v":"Z"},{"$f":"IF(R201=\"ja\",$A$1,0)","v":0},null,null,null,null,"","","","",""]
[{"$f":"IF(ISERROR(RANK(B202,$B$4:$B$203,0)),\"\",RANK(B202,$B$4:$B$203,0))","v":""},{"$f":"IF(COUNT(F202:I202)=1,SUM(F202:I202)-50,IF(COUNT(F202:I202)=2,SUM(F202:I202)-100,IF(COUNT(F202:I202)=3,SUM(F202:I202)-150,IF(COUNT(F202:I202)=4,SUM(F202:I202)-200,\"\"))))","v":""},{"$f":"IF(D202=\"\",\"\",L202)","v":""},null,{"$f":"IF(ISERROR(VLOOKUP(D202,Namen!A:B,2,0)),\"\",VLOOKUP(D202,Namen!A:B,2,0))","v":""},null,null,null,null,{"$f":"IF(D202=0,\"\",SUM(T202:W202))","v":""},{"$f":"IF(F202=0,\"\",MAX(F202:I202))","v":""},199,null,null,null,null,{"$f":"IF(ISERROR(VLOOKUP(D202,Namen!A:C,3,0)),\"Z\",VLOOKUP(D202,Namen!A:C,3,0))","v":"Z"},{"$f":"IF(ISERROR(VLOOKUP(D202,Namen!A:D,4,0)),\"Z\",VLOOKUP(D202,Namen!A:D,4,0))","v":"Z"},{"$f":"IF(R202=\"ja\",$A$1,0)","v":0},null,null,null,null,"","","","",""]
[{"$f":"IF(ISERROR(RANK(B203,$B$4:$B$203,0)),\"\",RANK(B203,$B$4:$B$203,0))","v":""},{"$f":"IF(COUNT(F203:I203)=1,SUM(F203:I203)-50,IF(COUNT(F203:I203)=2,SUM(F203:I203)-100,IF(COUNT(F203:I203)=3,SUM(F203:I203)-150,IF(COUNT(F203:I203)=4,SUM(F203:I203)-200,\"\"))))","v":""},{"$f":"IF(D203=\"\",\"\",L203)","v":""},null,{"$f":"IF(ISERROR(VLOOKUP(D203,Namen!A:B,2,0)),\"\",VLOOKUP(D203,Namen!A:B,2,0))","v":""},null,null,null,null,{"$f":"IF(D203=0,\"\",SUM(T203:W203))","v":""},{"$f":"IF(F203=0,\"\",MAX(F203:I203))","v":""},200,null,null,null,null,{"$f":"IF(ISERROR(VLOOKUP(D203,Namen!A:C,3,0)),\"Z\",VLOOKUP(D203,Namen!A:C,3,0))","v":"Z"},{"$f":"IF(ISERROR(VLOOKUP(D203,Namen!A:D,4,0)),\"Z\",VLOOKUP(D203,Namen!A:D,4,0))","v":"Z"},{"$f":"IF(R203=\"ja\",$A$1,0)","v":0},null,null,null,null,"","","","",""]

{"sheet":"Namen","index":1,"n_rows":748,"n_cols":4,"rows_kept":748,"cut":false,"hidden":false,"merged":[]}
["Name","Wohnort","Geschlecht","Startgeld"]
["Aigner Johann","n.n.","m","ja"]
["Alker Christiane","n.n.","w","ja"]
["Alram Norbert","Strasshof","m","ja"]
["Amon Josef","Großschweinbarth","m","ja"]
["Annawitt Regina","Hausbrunn","w","ja"]
["Antony Anton","Großkrut","m","ja"]
["Antosch Otmar","Hausbrunn","m","ja"]
["Aprea Johannes","Schleinbach","m","ja"]
["Artner Gustav","n.n.","m","ja"]
["Babinetz Andre ","n.n.","m","ja"]
["Barth Josef","n.n.","m","ja"]
["Batoha Reinhard","Hauskirchen","m","ja"]
["Bauer Rudi","Ebersdorf","m","ja"]
["Bayer Ernst","Hohenau","m","ja"]
["Bayer Wolfgang","Baumgarten/Tullnerfeld","m","ja"]
["Becher Alois","Althöflein","m","ja"]
["Berger Alois","Wien","m","ja"]
["Berger Leopold","Ebenthal","m","ja"]
["Bergmann Herbert","Strasshof","m","ja"]
["Berthold Christian","Hauskirchen","m","ja"]
["Berthold Herbert","Reyersdorf","m","ja"]
["Berthold Josef","Obersdorf","m","ja"]
["Berthold Michael","n.n.","m","ja"]
["Berthold Sabine","Reyersdorf","w","ja"]
["Bichl Christoph","Strasshof","m","ja"]
["Binder Johann","Altlichtenwarth","m","ja"]
["Biskup Johann","Altlichtenwarth","m","ja"]
["Bittner Franz","Ollersdorf","m","ja"]
["Bittner Manfred","Schrick","m","ja"]
["Blihall Erich","Königsbrunn","m","ja"]
["Bogner Roland","Langenschönbichl","m","ja"]
["Böhm Wolfgang","Obersdorf","m","ja"]
["Bött","","",""]
["Böttner Kurt","Angern","",""]
["Brandstetter Georg","Retz","m","ja"]
["Brandstetter Heinrich","Obersiebenbrunn","m","ja"]
["Brandtner Johann","n.n.","m","ja"]
["Breindl Herbert","Gross Harras","m","ja"]
["Briefer Norbert","Prottes","m","ja"]
["Brückl Walter","n.n.","m","ja"]
["Brunner Hans","Ollersdorf","m","ja"]
["Brunner Johann","Ollersdorf","m","ja"]
["Brunner Wolfgang","Deutsch Wagram","m","ja"]
["Brunnhuber Ernst","Obergänserndorf","m","ja"]
["Buchberger Paul","Wolkersdorf","m","ja"]
["Buchegger Paul","Fiedberg","m","ja"]
["Buchinger Franz","n.n.","m","ja"]
["Buchinger Sebastian","Gaweinstal","m","ja"]
["Buchmüller Engelbert","Nexing","m","ja"]
["Buchmüller Gabriele","Nexing","w","ja"]
["Bucsics Josef","Wolkersdorf","m","ja"]
["Buresch Josef","Enzersfeld","m","ja"]
["Burghart Rudolf","Strasshof","m","ja"]
["Caithamml Hans","Schleinbach","m","ja"]
["Capek Nora","Hohenau","w","ja"]
["Cardinaux Marc-André","Kleinebersdorf","m","ja"]
["Caspar Wolfgang","n.n.","m","ja"]
["Christ Herta","Großschweinbarth","w","ja"]
["Christ Leopold","n.n.","m","ja"]
["Czipke Rudolf","Wien","m","ja"]
["Czitober Nicolas","Wien","m","ja"]
["Degn Thomas","n.n.","m","ja"]
["Dichtl Helmut","n.n.","m","ja"]
["Dienbauer Josef","Schrick","m","ja"]
["Dietrich Werner","n.n.","m","ja"]
["Diope Sergine","n.n.","w","ja"]
["Dirnberger Reinhard","Wien","m","ja"]
["Dittrich Werner","Strasshof","m","ja"]
["Divotgey Johann","Retz","m","ja"]
["Domitzi Josef","Prottes","m","ja"]
["Doppler Nina","n.n","w","ja"]
["Dostal Walter","Kottingneusiedl","m","ja"]
["Drda Herbert","n.n.","m","ja"]
["Duschek Erich","Bogenneusiedl","m","ja"]
["Eberhard Karl","n.n.","m","ja"]
["Eckelhart Rudolf","n.n.","m","ja"]
["Eder Dietmar","n.n.","m","ja"]
["Eder Thomas","Strasshof","m","ja"]
["Edinger Fritz","Obersdorf","m","ja"]
["Edling Willi","Wien","m","ja"]
["Ehart Helmut","n.n.","m","ja"]
["Ehmayer Adolf","Dobermannsdorf","m","ja"]
["Eibner Thomas","Prottes","m","ja"]
["Eichberger Leopold","Enzersfeld","m","ja"]
["Eigner Erich","Strasshof","m","ja"]
["Eisenführer Franz","Klement","m","ja"]
["Eisenführer Manfred","Hornstein","m","ja"]
["Elend Albert","Prinzendorf","m","ja"]
["Elend Maria","Zistersdorf","w","ja"]
["Elfer Leo","Langenrohr","m","ja"]
["Elias Elfi","Wien","w","ja"]
["Ellend Andreas","Wilfersdorf","m","ja"]
["Epp Josef","Bad Pirawarth","m","ja"]
["Erdely Gerald","Strasshof","m","ja"]
["Ernst Josef","n.n.","m","ja"]
["Eschrich Bernd","Wien","m","ja"]
["Fabian Siegfried","n.n.","m","ja"]
["Fabigan Claudia","Wien","w","ja"]
["Fabschütz Wolfgang","Prottes","m","ja"]
["Falkner Andreas","Rabensburg","m","ja"]
["Fallnbügl Josef","Niederabsdorf","m","ja"]
["Fantner Monika","Großschweinbarth","w","ja"]
["Fasslabend Reinmar","n.n.","m","ja"]
["Fegerl Luise","n.n.","m","ja"]
["Felber Rudi","Ollersdorf","m","ja"]
["Fellner Leopold","n.n.","m","ja"]
["Fellner Otmar","Schönkirchen","m","ja"]
["Fellner Otto","n.n.","m","ja"]
["Fellner Roland","n.n.","m","ja"]
["Fleck Benjamin","n.n.","m","ja"]
["Fleckl Andi","Gaweinstal","m","ja"]
["Foral Roman","n.n.","m","ja"]
["Franzel Hans","Pframa","m","ja"]
["Freitag Silvia","Niederleis","w","ja"]
["Frenzel Hans","Pframa","m","ja"]
["Frey Josef","Kottingneusiedl","m","ja"]
["Frey Rudi","Prottes","m","ja"]
["Friedrich Reini","Ebenthal","m","ja"]
["Fritsch Thomas","n.n.","m","ja"]
["Frühwirth Johanna","Wien","w","ja"]
["Frummel Fritz","Wolkersdorf","m","ja"]
["Fuchs Ronald","Hauskirchen","m","ja"]
["Führer Manfred","Reintal","m","ja"]
["Fuhry Josef","Großkrut","m","ja"]
["Fuhry Roland","Großkrut","m","ja"]
["Fürhacker Rudolf","Pillichsdorf","m","ja"]
["Gaida Herbert","Hohenau","m","ja"]
["Galla Reinhold","Laa an der Thaya","m","ja"]
["Galleider Karl","Prottes","m","ja"]
["Gantner Karl","Hausbrunn","m","ja"]
["Gantner Roswitha","Hausbrunn","w","ja"]
["Gasseohr Johann","n.n.","m","ja"]
["Gattinger Gustav","Langenrohr","m","ja"]
["Gazso Johann","Großengersdorf","m","ja"]
["Gepp Jo","Wolkersdorf","m","ja"]
["Gieger Thomas","Wien","m","ja"]
["Gindl Christian","n.n.","m","ja"]
["Gindl Reinhard","Ollersdorf","m","ja"]
["Ginsthofer Alois","Langenrohr","m","ja"]
["Ginsthofer Rainer","Langenschönbichl","m","ja"]
["Ginsthofer Rudolf","Langenrohr","m","ja"]
["Glaser Gerhard","Reyersdorf","m","ja"]
["Glaser Giesela","Gänserndorf","w","ja"]
["Glasl Christian","Gaweinstal","m","ja"]
["Golliasch Gertrude","Großrussbach","w","ja"]
["Golliasch Günter","Großrussbach","m","ja"]
["Göschl Max","Wien","m","ja"]
["Gössl Leopold","Oberdorf","m","ja"]
["Gottwald Josef","Laa an der Thaya","m","ja"]
["Gottwald Roman","Strasshof","m","ja"]
["Götzel Arnold","n.n.","m","ja"]
["Graf Reinhold","Ebersdorf","m","ja"]
["Grömer Josef","n.n.","m","ja"]
["Gruber Josef","Grossrussbach","m","ja"]
["Gstaltner Georg","Bad Pirawarth","m","ja"]
["Gugler Ernst","Gänserndorf","m","ja"]
["Guschi Ernst","Wien","m","ja"]
["Gutscher Ferdinand","Langenrohr","m","ja"]
["Gutschi Ernst","Wolfsberg","m","ja"]
["Habenreiter Johannes","n.n.","m","ja"]
["Haberl Hubert","Mannersdorf","m","ja"]
["Haberl Michael","Gänserndorf","m","ja"]
["Hackl Ernst","n.n","m","ja"]
["Hagenmüller Hannes","n.n.","m","ja"]
["Hahn Herwig","Waltersdorf","m","ja"]
["Hahn Martin","Drösing","m","ja"]
["Haiden Gerold","Schönkirchen","m","ja"]
["Haller Johann","n.n.","m","ja"]
["Haselböck Franz","Obersdorf","m","ja"]
["Hauer Herbert","Zlabern","m","ja"]
["Hausner Sascha","Wien","m","ja"]
["Heinz Karl","Obergänserndorf","m","ja"]
["Heissler Willi","n.n.","m","ja"]
["Heller Manfred","Gänserndorf","m","ja"]
["Helmer Erwin","Großengersdorf","m","ja"]
["Hermann Andreas","Neubau","m","ja"]
["Herzog Reinhard","Strasshof","m","ja"]
["Heurteur Paul","Wolkersdorf","m","ja"]
["Hienerth Andreas","Maustrenk","m","ja"]
["Hiller Bernhard","Kottingneusiedl","m","ja"]
["Hiller Günther","Kottingneusiedl","m","ja"]
["Himmler Gerhard","Pressbaum","m","ja"]
["Hinczica Josef","Niederabsdorf","m","ja"]
["Hirsch Dieter","Altlichtenwarth","m","ja"]
["Hirschvogl Karl","Pillichsdorf","m","ja"]
["Hitter Leopold","Drösing","m","ja"]
["Hlinka Erich","Reyersdorf","m","ja"]
["Höbert Reinhard","Kottingneusiedl","m","ja"]
["Hofegger Josef","n.n.","m","ja"]
["Hofer Andreas","n.n.","m","ja"]
["Hofer Christoph","n.n.","m","ja"]
["Höfer Christoph","n.n.","m","ja"]
["Hoffmann Franz","Pillichsdorf","m","ja"]
["Höger Anton","Raggendorf","m","ja"]
["Höger Inge","Raggendorf","w","ja"]
["Holzbauer Gabi","n.n.","w","ja"]
["Holzbauer Gerhard","Schönfeld","m","ja"]
["Holzbauer Hans","n.n.","m","ja"]
["Holzbauer Leopold","n.n.","m","ja"]
["Holzbauer Manfred","n.n.","m","ja"]
["Holzbauer Marcus","n.n.","m","ja"]
["Holzbauer Martin","n.n.","m","ja"]
["Holzbauer Michael","n.n.","m","ja"]
["Holzbauer Reinhard","n.n.","m","ja"]
["Holzweber Erwin","n.n.","m","ja"]
["Hornyak Gabi","Nexing","w","ja"]
["Horung Ruppert","Reyersdorf","m","ja"]
["Höttner Erich","Hohenau","m","ja"]
["Hrdlicka Josef","n.n","m","ja"]
["Hubek Johann","n.n.","m","ja"]
["Huber Ernst","n.n.","m","ja"]
["Huber Franz","Großkrut","m","ja"]
["Huber Karl","Ringelsdorf","m","ja"]
["Huscava Bernhard","n.n.","m","ja"]
["Huscava Josef","n.n.","m","ja"]
["Hütter Erich","n.n.","m","ja"]
["Hüttner Erich","Hohenau","m","ja"]
["Idinger Josef","Hipples","m","ja"]
["Jaderka Monika","Strasshof","w","ja"]
["Jaderka Willi","Strasshof","m","ja"]
["Jammernegg Karl","n.n.","m","ja"]
["Jaros Christian","Waltersdorf","m","ja"]
["Jellen Ernst","Wien","m","ja"]
["Jirkal Fredy","Pellendorf","m","ja"]
["Jirkal Isabella","Pellendorf","w","ja"]
["Joksch Johann","Strasshof","m","ja"]
["Josume Josef","Obersdorf","m","ja"]
["Joszt Silvia","Strasshof","w","ja"]
["Juhasz Günter","Strasshof","m","ja"]
["Kafonek Josef","Strasshof","m","ja"]
["Kaider Franz","Stopfenreuth","m","ja"]
["Kaider Josef","Großkrut","m","ja"]
["Kainz Günther","Korneuburg","m","ja"]
["Kainz Karl","Obergänserndorf","m","ja"]
["Kainzbauer Kurt","Langenrohr","m","ja"]
["Kainzmayer Dietmar","n.n.","m","ja"]
["Kaipl Gerald","n.n.","m","ja"]
["Kaiser Josef","Großkrut","m","ja"]
["Kaiser Stefan","Hipples","m","ja"]
["Kalbacher Hannes","Schleinbach","m","ja"]
["Kaller Johann","Gerasdorf","m","ja"]
["Kaltenbrunner Helmut","Großschweinbarth","m","ja"]
["Kaltenbrunner Johann","n.n.","m","ja"]
["Kaltenbrunner Leo","Obergänserndorf","m","ja"]
["Kapfinger Erich","Reyersdorf","m","ja"]
["Kapfinger Herbert","Reyersdorf","m","ja"]
["Kapfinger Raimund","n.n.","m","ja"]
["Kappel Wolfgang","Wien","m","ja"]
["Karlowitsch Gerd","Gänserndorf","m","ja"]
["Karpf Karl","Pillichsdorf","m","ja"]
["Kaufmann Josef","Kollnbrunn","m","ja"]
["Kaufmann Josef sen.","n.n.","m","ja"]
["Kaufmann Michael","n.n.","m","ja"]
["Kauper Ernst","n.n.","m","ja"]
["Kautz Johann","Neuruppersdorf","m","ja"]
["Kern Richard","Ebenthal","m","ja"]
["Kerschbaumer Martin","Wien","m","ja"]
["Kirchmaier Engelbert","Rückersdorf","m","ja"]
["Klein Manuel","Langenrohr","m","ja"]
["Klima Josef","n.n.","m","ja"]
["Kloiber Anton","Anger","m","ja"]
["Klug Josef","Prottes","m","ja"]
["Kober Josef","Wien","m","ja"]
["Köck Helmut","Niederabsdorf","m","ja"]
["Köck Herbert","Niederabsdorf","m","ja"]
["Köhbach Erich","n.n.","m","ja"]
["Kohl Josef","Drösing","m","ja"]
["Kölch Fritz","Ollersdorf","m","ja"]
["Koller Alois","n.n.","m","ja"]
["Koller Gerhard","n.n.","m","ja"]
["Köllner Jochen","Prottes","m","ja"]
["Köllner Johann","Prottes","m","ja"]
["Konar Josef","n.n.","m","ja"]
["Konar Rupert jun.","n.n.","m","ja"]
["Konar Rupert sen.","n.n.","m","ja"]
["Konar Thomas","n.n.","m","ja"]
["Köpf Herbert","n.n.","m","ja"]
["Körmer Leopold","Münichsthal","m","ja"]
["Kornherr Wilfried","Kottingneusiedl","m","ja"]
["Kosel Lucia","Wien","w","ja"]
["Kostersitz Franz","Strasshof","m","ja"]
["Kotasek Friederike","Wien","w","ja"]
["Kotrba Erwin","n.n.","m","ja"]
["Kovacs Franz","Groissenbrunn","m","ja"]
["Kovacs Walter","n.n.","m","ja"]
["Kovarik Katja","Hohenau","w","ja"]
["Kowac Hans","n.n.","m","ja"]
["Kozeschnik Peter","Wien","m","ja"]
["Kraft Johannes","n.n.","m","ja"]
["Krahofer Wilhelm","Münichsthal","m","ja"]
["Kratzer Ursula","Wien","w","ja"]
["Kraus Herbert","n.n.","m","ja"]
["Krautsieder Gerald","n.n.","m","ja"]
["Krebs Herbert","Kronberg","m","ja"]
["Kremsl Gerhard","Hartberg","m","ja"]
["Krenbek Franz","n.n.","m","ja"]
["Kressnik Matthias","Angern","m","ja"]
["Krexner Leopold","Prinzendorf","m","ja"]
["Krhla Heinz","Marchegg","m","ja"]
["Krickl Günther","Unterstinkenbrunn","m","ja"]
["Kridlo Sabine","Jedenspeigen","w","ja"]
["Kriz Franz","Münichsthal","m","ja"]
["Kriz Wolfgang","Traunfeld","m","ja"]
["Kroll Matthias","Hausbrunn","m","ja"]
["Kronberger Friedrich","n.n.","m","ja"]
["Kronberger Walter","n.n","m","ja"]
["Krych Josef","Wien","m","ja"]
["Kumhofer Alois","n.n.","m","ja"]
["Kump Robert","n.n.","m","ja"]
["Kunst Walter","n.n.","m","ja"]
["Kuril Michael","Hauskirchen","m","ja"]
["Kuril Norbert","Neusiedl a.d. Zaya","m","ja"]
["Kuzdas Leo","Pellendorf","m","ja"]
["Kvasnicka Ingrid","Katzelsdorf","w","ja"]
["Lackermayer Günter ","Obergänserndorf","m","ja"]
["Lackermayer Johann","n.n.","m","ja"]
["Lackner Anton","Leobendorf","m","ja"]
["Lahner Herbert","Pyhra","m","ja"]
["Lampl Horst","Wien","m","ja"]
["Lang Ewald","Gänserndorf","m","ja"]
["Lang Gabriele","Maustrenk","w","ja"]
["Lang Otto","n.n.","m","ja"]
["Langer Ernst","Strasshof","m","ja"]
["Langer Herbert","Deutsch-Wagram","m","ja"]
["Lautenbach Adolf","Hohenau","m","ja"]
["Lehner Florian","n.n.","m","ja"]
["Lehner Franz","Reintal","m","ja"]
["Lehner Johann","Schrick","m","ja"]
["Lehner Karl","Hausbrunn","m","ja"]
["Lehner Ludwig","n.n.","m","ja"]
["Leidorf Franz","Gaweinstal","m","ja"]
["Lembeck Wilhelm","Strasshof","m","ja"]
["Lendeck Wilhelm","Strasshof","m","ja"]
["Lenhart Walter","Hohenau","m","ja"]
["Lindmaier Josef","Hohenau","m","ja"]
["Lindner Herbert","Wien","m","ja"]
["Link Christian","n.n.","w","ja"]
["Lipowsky Harald","Strasshof","m","ja"]
["Litschauer Inge","Wien","w","ja"]
["Litschauer Rupert","Gänserndorf","m","ja"]
["Litschauer Walter","Großschweinbarth","m","ja"]
["Löbl Franz","Höbersbrunn","m","ja"]
["Lobner Gerhard","Spannberg","m","ja"]
["Löffler Christa","Raggendorf","w","ja"]
["Ludwig Dieter","Ollersdorf","m","ja"]
["Macho Josef","n.n.","m","ja"]
["Maier Erich","Kottingneusiedl","m","ja"]
["Maisl Ludwig","Niederleis","m","ja"]
["Malina Elfriede","n.n.","w","ja"]
["Marchart Franz","Großkrut","m","ja"]
["Marcher Erwin","n.n.","m","ja"]
["Marek Kurt","Gänserndorf","m","ja"]
["Marintschak Robert","n.n.","m","ja"]
["Marko Josef","n.n.","m","ja"]
["Marko Wolfgang","n.n.","m","ja"]
["Marschall Thomas jun.","Langenschönbichl","m","ja"]
["Matz Manfred","Reyersdorf","m","ja"]
["Matzinger Brigitte","Kettlasbrunn","w","ja"]
["Matzinger Michael","Kettlasbrunn","m","ja"]
["Matzinger Siegfried","Wilfersdorf","m","ja"]
["Matzka Franz","Rannersdorf","m","ja"]
["Matzka Harald","Schönkirchen","m","ja"]
["Matzka Josef","Hausbrunn","m","ja"]
["Mauer Helmut","n.n.","m","ja"]
["Maurer Helmut","Obergänserndorf","m","ja"]
["Mayer Gerald","Prinzendorf","m","ja"]
["Mayer Leo","Leobendorf","m","ja"]
["Mayer Rudolf","n.n.","m","ja"]
["Mayerhuber Erwin","Enzersfeld","m","ja"]
["Mayrhuber Erwin","Enzersfeld","m","ja"]
["Mechtler Leopold","Obersdorf","m","ja"]
["Mechtler Simon","n.n","m","ja"]
["Meier Karl","Schönkirchen","m","ja"]
["Meissl Leo","Angern","m","ja"]
["Meissl Ludwig","Niederleis","m","ja"]
["Meissner Claus","n.n.","m","ja"]
["Meixner Leo","Tallesbrunn","m","ja"]
["Mende Gernot","n.n.","m","ja"]
["Menschik Alfred","Prottes","m","ja"]
["Metzele Eduard","n.n.","m","ja"]
["Mirtl Harald","Strasshof","m","ja"]
["Mokesch Ewald","Rabensburg","m","ja"]
["Mokesch Friedrich","Hohenau","m","ja"]
["Momitzi Josef","n.n.","m","ja"]
["Moritz Norbert","n.n.","m","ja"]
["Mosthammer Andreas","Raggendorf","m","ja"]
["Mosthammer Harald","Bad Pirawarth","m","ja"]
["Mosthammer Hermann","Bad Pirawarth","m","ja"]
["Mraz Egon","Breitensee","m","ja"]
["Mück Hannes","n.n.","m","ja"]
["Müllebner Georg","Obersdorf","m","ja"]
["Müllebner Herbert","Pilichsdorf","m","ja"]
["Müller Erich","Wien","m","ja"]
["Müller Gerhard","Gänserndorf","m","ja"]
["Müller Monika","Weikendorf","w","ja"]
["Müller Philipp","Strasshof","m","ja"]
["Müllner Alois","Großengersdorf","m","ja"]
["Müllner Ernst","Schwarza","m","ja"]
["Müllner Franz","Kottingneusiedl","m","ja"]
["Müllner Johann","n.n.","m","ja"]
["Müllner Karl","Großengersdorf","m","ja"]
["Müllner Ludwig","n.n.","m","ja"]
["Müllner Otto","Grub","m","ja"]
["Müllner-Rieder Franz","Ameis","m","ja"]
["Munk Robert","Strasshof","m","ja"]
["Nassek Werner","Asparn","m","ja"]
["Neduchal Franz","n.n.","m","ja"]
["Nekolar Peter","n.n.","m","ja"]
["Nell Anna","Großrussbach","w","ja"]
["Neller Manfred","Strasshof","m","ja"]
["Nemec Walter","Wien","m","ja"]
["Nemeth Günther","n.n.","m","ja"]
["Nemeth Simone","Wien","w","ja"]
["Neugschwendtner Bernd","n.n.","m","ja"]
["Neugschwendtner Herbert","n.n.","m","ja"]
["Neuhold Clemens","Großkrut","m","ja"]
["Neumann Karl","n.n.","m","ja"]
["Neumeister Johann","Hohenau","m","ja"]
["Neustifter Wolfgang","n.n.","m","ja"]
["Nissler Franz","Hüttendorf","m","ja"]
["Novacek Josef","n.n","m","ja"]
["Novak Isabella","Bad Pirawarth","w","ja"]
["Nowak Isabella","n.n.","w","ja"]
["Nürnberger Alfred","Ollersdorf","m","ja"]
["Oberenzer Helmut","Laa an der Thaya","m","ja"]
["Obermaier Thomas","Hautzendorf","m","ja"]
["Orban Reinhard","Dürnkrut","m","ja"]
["Ordelt Andreas","n.n.","m","ja"]
["Österreicher Mathias","n.n.","m","ja"]
["Österreicher Reinhard","Prinzendorf","m","ja"]
["Paltram Walter","Hüttendorf","m","ja"]
["Paminger Herbert","n.n.","m","ja"]
["Paminger Paul","n.n.","m","ja"]
["Panzer Robert","Prottes","m","ja"]
["Parth Josef","Großengersdorf","m","ja"]
["Parth Karl jun.","n.n.","m","ja"]
["Parth Karl sen.","n.n.","m","ja"]
["Pauer Erik","Bad Pirawarth","m","ja"]
["Peceny Renate","Niederleis","w","ja"]
["Peck Johann","n.n.","m","ja"]
["Pellinger Josef","n.n.","m","ja"]
["Pellinger Manfred","n.n.","m","ja"]
["Permann Alexander","Strasshof","m","ja"]
["Pernold Karl","Hausbrunn","m","ja"]
["Perthold Herbert","Reyersdorf","m","ja"]
["Perthold Sabine","Reyersdorf","w","ja"]
["Peska Rudolf","Hohenau","m","ja"]
["Peter Manfred","Drösing","m","ja"]
["Petru Hubert","Hautzendorf","m","ja"]
["Pfandtner Monika","n.n.","w","ja"]
["Pfeifer Manfred","n.n.","m","ja"]
["Pfister Richard","Langenrohr","m","ja"]
["Pflaumer Roland","Althöflein","m","ja"]
["Pfundner Albert","Hohenau","m","ja"]
["Pilacek Marianne","n.n.","w","ja"]
["Pinczker Robert","n.n.","m","ja"]
["Pinnisch Harald","Ollersdorf","m","ja"]
["Pirkner Herbert","Obersulz","m","ja"]
["Pittner Franz","n.n.","m","ja"]
["Pitzinger Alfons","n.n.","m","ja"]
["Platt Rudolf","Großschweinbarth","m","ja"]
["Pleyl Gerhard","Ulrichskirchen","m","ja"]
["Pokorny Toni","Wien","m","ja"]
["Pöll Verena","Wien","w","ja"]
["Pollack Anton","n.n.","m","ja"]
["Pöltner Kurt","n.n.","m","ja"]
["Popp Andreas","Bad Pirawarth","m","ja"]
["Popp Luzia","Wien","w","ja"]
["Popp Richard","Wien","m","ja"]
["Popp Robert","Wien","m","ja"]
["Pospischil Eduard","Kottingneusiedl","m","ja"]
["Prager Robert","Prottes","m","ja"]
["Pratsch Peter","Ollersdorf","m","ja"]
["Pribyl Rudolf","n.n.","m","ja"]
["Prohaska Alfred","Deutsch-Wagram","m","ja"]
["Prokop Rudolf","Hohenau","m","ja"]
["Puchberger Paul","Wolkersdorf","m","ja"]
["Pühringer Mario","n.n.","m","ja"]
["Pupfi","n.n.","m","ja"]
["Pusam Bernhard","Wien","m","ja"]
["Pusam Eduard","Wien","m","ja"]
["Pusam Herbert","Wien","m","ja"]
["Pusam Michael","Wien","m","ja"]
["Pusam Stephanie","n.n.","w","ja"]
["Putz Alfred","n.n.","m","ja"]
["Rabenlehner Anton","Obergänserndorf","m","ja"]
["Rabenlehner Johann","n.n.","m","ja"]
["Rabenreither Johann","Schrick","m","ja"]
["Rabenreither Johannes","Schrick","m","ja"]
["Raschitz Karl","n.n.","m","ja"]
["Rath Josefine","n.n.","w","ja"]
["Rathammer Gerhard","Drösing","m","ja"]
["Rauch Rudolf","Weinstaig","m","ja"]
["Rauscher Gerhard","Wien","m","ja"]
["Rebel Leo","n.n.","m","ja"]
["Reckendorfer Günther","n.n.","m","ja"]
["Redl Toni","Lanzendorf","m","ja"]
["Reichel Alfred","Gänserndorf","m","ja"]
["Reichel Manfred","Gänserndorf","m","ja"]
["Reichel Walter","n.n.","m","ja"]
["Reidlinger Herbert","Seyring","m","ja"]
["Reimer Ernst","n.n","m","ja"]
["Reimer Norbert","Bad Pirawarth","m","ja"]
["Reinwein Josef","Wien","m","ja"]
["Reisinger Rudolf","Zistersdorf","m","ja"]
["Rejda Traude","Strasshof","w","ja"]
["Resch Anton","Langenrohr","m","ja"]
["Retzl Johann","Hausbrunn","m","ja"]
["Retzl Reinhard","Hausbrunn","m","ja"]
["Ribisch Karl","Hausbrunn","m","ja"]
["Richl Josef","n.n.","m","ja"]
["Rickl Johannes","n.n.","m","ja"]
["Rickl Josef","n.n.","m","ja"]
["Rieder Helmut","Asparn","m","ja"]
["Rieger Werner","Prinzendorf","m","ja"]
["Riepl Norbert","Au","m","ja"]
["Riepl Stefan","Hipples","m","ja"]
["Rirsch Karl Sen.","Strasshof","m","ja"]
["Rochschitz Karl","Unterolberndorf","m","ja"]
["Roschitz Karl","Unterolberndorf","m","ja"]
["Rosenmayer Karl","n.n.","m","ja"]
["Rosenmayer Paul","Wien","m","ja"]
["Rötzer Anton","Kleinebersdorf","m","ja"]
["Rötzer Helmut","Kleinebersdorf","m","ja"]
["Rötzer Leopold","Klement","m","ja"]
["Rötzer Michael","Kleinebersdorf","m","ja"]
["Ruggenthaler Christian","n.n.","m","ja"]
["Ruso Karl","n.n.","m","ja"]
["Rutar Ernst","n.n.","m","ja"]
["Ruthar Ernst","Raggendorf","m","ja"]
["Rzavsky Thomas","Palterndorf","m","ja"]
["Saimhofer Viktor","n.n.","m","ja"]
["Salcher Dominik","n.n.","m","ja"]
["Salomon Wolfgang","Münichsthal","m","ja"]
["Samstag Alfred","Reyersdorf","m","ja"]
["Sandriesser Florian","n.n.","m","ja"]
["Sator Katharina","Hausbrunn","w","ja"]
["Sattler Thomas","Hohenruppersdorf","m","ja"]
["Sauerzapf Franz","Rabensburg","m","ja"]
["Schaffer Isi","n.n.","m","ja"]
["Schandl Manfred","Schönkirchen","m","ja"]
["Scharinger Herbert","Hausbrunn","m","ja"]
["Scharringer Matthias","Prinzendorf","m","ja"]
["Schilhan Anton","Prottes","m","ja"]
["Schimek Otto","Hohenau","m","ja"]
["Schlagbauer Rupert","Pillichsdorf","m","ja"]
["Schlemmer Katharina","Großkrut","w","ja"]
["Schlifelner Richard","Großkrut","m","ja"]
["Schlifelner Richard sen.","Großkrut","m","ja"]
["Schlössel Franz","n.n.","m","ja"]
["Schmid Christian","n.n.","m","ja"]
["Schmid Harald","Ollersdorf","m","ja"]
["Schmid Hermann","n.n.","m","ja"]
["Schmid Markus","Großschweinbarth","m","ja"]
["Schmidl Franz","Unterstinkenbrunn","m","ja"]
["Schmidmayer Christian","n.n.","m","ja"]
["Schmidt Helmut","Hauskirchen","m","ja"]
["Schmidt Markus","Großschweinbarth","m","ja"]
["Schmöllerl Alfred","Obergänserndorf","m","ja"]
["Schneider Dietmar","Großrussbach","m","ja"]
["Schneider Doris","Dürnkrut","w","ja"]
["Schneider Günter","Hausbrunn","m","ja"]
["Schneider Rudolf","Gaweinstal","m","ja"]
["Schneller Adolf","Retz","m","ja"]
["Schöfnagl Hermann","n.n.","m","ja"]
["Scholl Otto","n.n.","m","ja"]
["Schön Raimund","Waltersdorf","m","ja"]
["Schön Willi","Strasshof","m","ja"]
["Schöner Manuel","n.n.","m","ja"]
["Schrammel Karl","Obergänserndorf","m","ja"]
["Schreiner Berndt","n.n.","m","ja"]
["Schreiner Karl","n.n.","m","ja"]
["Schreitl Konrad","Gaweinstal","m","ja"]
["Schröck Karl","n.n.","m","ja"]
["Schubtschik Franz","Hausbrunn","m","ja"]
["Schubtschik Wilhelm","Hohenau","m","ja"]
["Schuckert Christian","Wien","m","ja"]
["Schuckert Johannes","Wien","m","ja"]
["Schuckert Michaela","Großrußbach","w","ja"]
["Schüller Josef ","Schrick","m","ja"]
["Schultes Christian","Reyersdorf","m","ja"]
["Schütt Peter ","Bad Pirawarth","m","ja"]
["Schwalm Josef","Hausbrunn","m","ja"]
["Schwec Rudolf","Hausbrunn","m","ja"]
["Schwec Rudolf sen.","Hausbrunn","m","ja"]
["Schweng Anton","Großkrut","m","ja"]
["Schweng Franz","n.n.","m","ja"]
["Schweng Gustav","n.n.","m","ja"]
["Schweng Josef","Altlichtenwarth","m","ja"]
["Schweng Josef 1","Altlichtenwarth","m","ja"]
["Schwingenschrot Manfred","Hausbrunn","m","ja"]
["Sdrand Robert","n.n.","m","ja"]
["Seiter Andreas","Waltersdorf","m","ja"]
["Seiter Franz","Waltersdorf","m","ja"]
["Seltenhammer Leopold","Rannersdorf","m","ja"]
["Setik Martin","Hohenau","m","ja"]
["Sieberer Franz","Deutsch-Wagram","m","ja"]
["Silberbauer Helmut","Drösing","m","ja"]
["Simi Hans","Gaweinstal","m","ja"]
["Simon Johann","n.n.","m","ja"]
["Simonovsky Johann","Gaweinstal","m","ja"]
["Sitz Richard","Strasshof","m","ja"]
["Skladany Manfred","Schönfeld","m","ja"]
["Skladany Richard","n.n.","m","ja"]
["Skoda Harald","Deutsch-Wagram","m","ja"]
["Slama Reinhard","n.n.","m","ja"]
["Slamer Reinhard","Strasshof","m","ja"]
["Spannring Sigi","Wien","m","ja"]
["Sperk Franz","Jedenspeigen","m","ja"]
["Srba Andreas","Angern","m","ja"]
["Srbia Andreas","n.n.","m","ja"]
["Sryba Andreas","Angern","m","ja"]
["Stacher Reinhard","Schletz","m","ja"]
["Stapanoy Alfred","Bad Pirawarth","m","ja"]
["Staringer Markus","Ollersdorf","m","ja"]
["Steinek Walter","Wien","m","ja"]
["Steingläubl Gerhard ","Gaweinstal","m","ja"]
["Stepanoy Alfred","n.n.","m","ja"]
["Stich Josef","Weinsteig","m","ja"]
["Sticha Thomas","Hauskirchen","m","ja"]
["Stidl Reinhard","Pillichsdorf","m","ja"]
["Stmad Robert","Wien","m","ja"]
["Stöckl Helmut","n.n.","m","ja"]
["Stoiber Gerhard ","Pellendorf","m","ja"]
["Stoik Willi","n.n.","m","ja"]
["Strahal Andrea","n.n.","w","ja"]
["Strasser Helmut","Hauskirchen","m","ja"]
["Strauß Johann","Schönkirchen","m","ja"]
["Strecker Bruno","Großrussbach","m","ja"]
["Strnad Robert","Wien","m","ja"]
["Strohmayer Johann","Velm-Götzendorf","m","ja"]
["Stubits Gerhard","n.n.","m","ja"]
["Stummer Leopold","Strasshof","m","ja"]
["Sukup Adolf","Hohenau","m","ja"]
["Supper Erwin","Wien","m","ja"]
["Taporski Erwin","n.n.","m","ja"]
["Tasch Manfred","Pillichsdorf","m","ja"]
["Taschner Norbert","Wien","m","ja"]
["Taurok Hanns","Langenzersdorf","m","ja"]
["Tegelhofer Harald","n.n.","m","ja"]
["Tesa Josef","n.n.","m","ja"]
["Tesar Klaus","n.n","m","ja"]
["Teufelhart Franz","n.n.","m","ja"]
["Teuretzbachner Peter","n.n.","m","ja"]
["Theuretzbachner Peter","Kollnbrunn","m","ja"]
["Thümmerer Johann","Hauskirchen","m","ja"]
["Tichy Franz","Strasshof","m","ja"]
["Tillich Franz","Hohenau","m","ja"]
["Toifl Franz","n.n.","m","ja"]
["Toifl Reinhard","Streifing","m","ja"]
["Toth Michael","Schönkirchen","m","ja"]
["Trenner Christoph","Schleinbach","m","ja"]
["Trenner Josef","n.n","m","ja"]
["Trenz Thomas","Strasshof","m","ja"]
["Tringl Ernst","Kollnbrunn","m","ja"]
["Trinko Helmut","Marchegg","m","ja"]
["Trully Gerhard","n.n.","m","ja"]
["Tuitz Johann","n.n.","m","ja"]
["Tunhardt Angelika","Strasshof","w","ja"]
["Turecek Erwin","Rabensburg","m","ja"]
["Turetschek Alfred","Waltersdorf","m","ja"]
["Ubl Bernhard","Bockfließ","m","ja"]
["Ullrich Bertl","Gaweinstal","m","ja"]
["Umlauf Rita","Marchegg","w","ja"]
["Unger Herbert","Obersdorf","m","ja"]
["Urani Martin","n.n.","m","ja"]
["Vachalek Johannes","n.n.","m","ja"]
["Vachalek Martin","n.n.","m","ja"]
["Vandrovec Walter","Loosdorf","m","ja"]
["Vasatko Johann","Wien","m","ja"]
["Vastko Johann","n.n.","m","ja"]
["Vock Ferdinand","Obersiebenbrunn","m","ja"]
["Vock Horst","Raggendorf","m","ja"]
["Vock Josef","n.n.","m","ja"]
["Vock Siegfried","Ollersdorf","m","ja"]
["Vogt Christian","Wolkersdorf","m","ja"]
["Vogt Ferdinand","Obersiebenbrunn","m","ja"]
["Vogt Theo","Pillichsdorf","m","ja"]
["Vonderlind Gerhard","Wolfpassing","m","ja"]
["Votzi Paul","n.n.","m","ja"]
["Votzi Richard","n.n.","m","ja"]
["Vrzal Roman","n.n.","m","ja"]
["Wabitsch Josef","Breitensee","m","ja"]
["Wabitsch Walter","n.n.","m","ja"]
["Wagner Andreas","n.n.","m","ja"]
["Wagner Kurt","Kottingneusiedl","m","ja"]
["Waldegger Markus","Ebersdorf","m","ja"]
["Waldrauch Horst","Breitensee","m","ja"]
["Weber Franz","Enzersfeld","m","ja"]
["Weber Johann","n.n","m","ja"]
["Wegscheider Franz","n.n.","m","ja"]
["Weidinger Johannes","Wulzeshofen","m","ja"]
["Weingartshofer Franz jun.","Großkrut","m","ja"]
["Weingartshofer Franz NV","Großkrut","m","ja"]
["Weingartshofer Franz sen.","Großkrut","m","ja"]
["Weinhofer Roman","Strasshof","m","ja"]
["Weinhofer Walter","Bad Pirawarth","m","ja"]
["Weinmann Josef","Neuruppersdorf","m","ja"]
["Weiskirchner Josef","Pillichsdorf","m","ja"]
["Weiss Franz","Großkrut","m","ja"]
["Weiss Rudolf","n.n.","m","ja"]
["Welser Johann","Niederabsdorf","m","ja"]
["Wenth Johann","n.n.","m","ja"]
["Wiedermann Monika","Hausbrunn","w","ja"]
["Wieland Franz","Gerasdorf","m","ja"]
["Wieland Karin","Gerasdorf","w","ja"]
["Wiesinger Ernst","n.n.","m","ja"]
["Wiesinger Walter","Gaweinstal","m","ja"]
["Wiesmann Herbert","Neuruppersdorf","m","ja"]
["Wimmer Adolf","Laa an der Thaya","m","ja"]
["Wimmer Michael","Gaweinstal","m","ja"]
["Winkler Christian","Reintal","m","ja"]
["Winter Christoph","Großkrut","m","ja"]
["Winter Josef","Obersulz","m","ja"]
["Witschka Bernd","Schönkirchen","m","ja"]
["Witschka Hermann","n.n.","m","ja"]
["Wittmann Alfred","Waltersdorf","m","ja"]
["Wögerer Erich","Kleinebersdorf","m","ja"]
["Wojtosiszyn Johann","n.n.","m","ja"]
["Wolf Sissi","Reyersdorf","w","ja"]
["Wölfel Ferdinand","Hausbrunn","m","ja"]
["Wölfel Herbert","Hausbrunn","m","ja"]
["Wölfel Karl","Altlichtenwarth","m","ja"]
["Wunderer Manfred","Wien","m","ja"]
["Wunderl Frida","Witzelsdorf","w","ja"]
["Wunderl Fritz","Witzelsdorf","m","ja"]
["Wunderlich Adelheid","Strasshof","w","ja"]
["Wunsch Matthias","Altlichtenwarth","m","ja"]
["Wurzian Walter","Weinsteig","m","ja"]
["Wurzinger Alois","Langenrohr","m","ja"]
["Wurzinger Johann","n.n.","m","ja"]
["Wustinger Hermine","Wien","w","ja"]
["Zdrahal Andrea","Hohenau","w","ja"]
["Zeiler Josef","Schleinbach","m","ja"]
["Zelenka Hans","Lerchenau","m","ja"]
["Zentner Norbert","Wien","m","ja"]
["Zettl Andreas","Mistelbach","m","ja"]
["Zickl Johann","Gaweinstal","m","ja"]
["Zickl Josef","Gaweinstal","m","ja"]
["Zickl Wolfgang","Gaweinstal","m","ja"]
["Zillinger Manfred","Ollersdorf","m","ja"]
["Zimmermann Josef","Oberkreuzstetten","m","ja"]
["Zinsberger Ernst","Niederhollabrunn","m","ja"]
["Zöhrer Kurt","n.n.","m","ja"]
["Zöllner Manfred","n.n.","m","ja"]
["Zotter Franz","n.n.","m","ja"]
["Zovinec Ernst","n.n.","m","ja"]

{"sheet":"Spieler_n_Ort","index":2,"n_rows":69,"n_cols":2,"rows_kept":69,"cut":false,"hidden":false,"merged":[]}
["Ort","Anzahl von Ort"]
[null,41]
["Wien",18]
["Hausbrunn",15]
["Hohenau",10]
["Großkrut",6]
["Strasshof",6]
["Gänserndorf",5]
["Niederabsdorf",4]
["Reyersdorf",3]
["Ollersdorf",3]
["Reintal",3]
["Schleinbach",3]
["Breitensee",3]
["Obergänserndorf",3]
["Langenrohr",3]
["Großschweinbarth",3]
["Angern",3]
["Prottes",3]
["Rabensburg",3]
["Marchegg",3]
["Altlichtenwarth",2]
["Kottingneusiedl",2]
["Klement",2]
["Enzersfeld",2]
["Jedenspeigen",2]
["Pillichsdorf",2]
["Gaweinstal",2]
["Ebenthal",2]
["Waltersdorf",2]
["Weikendorf",1]
["Deutsch-Wagram",1]
["Korneuburg",1]
["Großengersdorf",1]
["Katzelsdorf",1]
["Hauskirchen",1]
["Niederleis",1]
["Obersdorf",1]
["Obersiebenbrunn",1]
["Raggendorf",1]
["Bad Pirawarth",1]
["Stopfenreuth",1]
["Dobermannsdorf",1]
["Witzelsdorf",1]
["Wolkersdorf",1]
["Bockfließ",1]
["Althöflein",1]
["Münichsthal",1]
["Maustrenk",1]
["Rückersdorf",1]
["Hohenruppersdorf",1]
["Nexing",1]
["Schrick",1]
["Zistersdorf",1]
["Unterolberndorf",1]
["Wolfsberg",1]
["Schönkirchen",1]
["Palterndorf",1]
["Velm-Götzendorf",1]
["Spannberg",1]
["Ulrichskirchen",1]
["Rannersdorf",1]
["Grossrussbach",1]
["Grub",1]
["Hautzendorf",1]
["Ringelsdorf",1]
["Drösing",1]
["Prinzendorf",1]
[null,{"$f":"SUM(B2:B68)","v":197}]

{"sheet":"Veranstaltungsort","index":3,"n_rows":34,"n_cols":2,"rows_kept":34,"cut":false,"hidden":false,"merged":[]}
["Ort","Lokalität"]
["Angern an der March","GH Kunst"]
["Au","GH Riepl"]
["Bad Pirawarth","GH Novakovic"]
["Ebenthal","Cafe Pub Paula"]
["Enzersfeld","Sportplatz-Kantine"]
["Fuchsenbigl","GH Leberbauer"]
["Gaweinstal","Heurigenlokal Zickl"]
["Großengersdorf","GH Glöckler"]
["Großkrut","Heurigenlokal Weingartshofer"]
["Großrußbach","Sportplatz-Kantine"]
["Groß-Schweinbarth","Hofkeller"]
["Hausbrunn","Atrium"]
["Hausbrunn","GH Schweinberger"]
["Hohenau","Stockplatz"]
["Hüttendorf","Alte Schule"]
["Kollnbrunn","GH Urbanusalm"]
["Kottingneusiedl","GH Zum edlen Tropfen"]
["Langenrohr","Sportplatz-Kantine"]
["Obergänserndorf","Sportplatz-Kantine"]
["Obergänserndorf","Sportplatz-Kantine"]
["Ollersdorf","Dorfstadl"]
["Ollersdorf","GH Zeisl Wirt"]
["Pillichsdorf","GH Schurlwirt"]
["Prinzendorf an der Zaya","GH Schwab"]
["Prinzendorf an der Zaya","FF-Haus neu"]
["Prottes","Sportplatz-Kantine"]
["Schönfeld im Marchfeld","GH Krelik"]
["Schönkirchen-Reyersdorf","Schönkirchsaal"]
["Schönkirchen-Reyersdorf","GH Szerb"]
["Schrick","Sportplatz-Kantine"]
["Strasshof","Haus der Begegnung"]
["Waltersdorf","GH zur Katarina"]
["Wolkersdorf","Tennishalle"]